{"text_format":"1","workbook":"xlsx","n_sheets":6,"sheets":["【準備】登録","【準備】対戦カード","【進行】結果入力表","【結果】個人成績表","【結果】リーグ成績表","【結果】総合結果表"],"not_rendered":{"charts":0,"images":3,"macros":1,"external_links":0,"defined_names":7,"comments":2,"pivot_tables":0},"unopened":[],"bounds":{"document_bytes":16777216,"sheet_cells":100000,"rows_first":2000,"rows_last":500,"rows_between":2000,"halvings":0,"cell_chars":16384,"cell_head_chars":4096},"cells_cut":0,"cells_raw":0,"read":"whole","date_system":"1900"}

{"sheet":"【準備】登録","index":0,"n_rows":26,"n_cols":27,"rows_kept":26,"cut":false,"hidden":false,"merged":[[11,24,11,25],[9,21,9,22],[10,9,10,10],[9,12,9,13],[11,12,11,13],[1,6,1,7],[10,1,10,2],[10,6,10,7],[3,3,3,6],[8,1,9,2],[9,6,9,7],[5,3,5,8],[8,3,8,5],[8,6,8,8],[10,3,10,4],[12,1,12,2],[11,3,11,4],[12,3,12,4],[11,1,11,2],[12,24,12,25],[9,3,9,4],[8,18,8,20],[9,18,9,19],[12,21,12,22],[10,18,10,19],[10,21,10,22],[8,21,8,23],[8,24,8,26],[9,24,9,25],[11,18,11,19],[11,21,11,22],[12,18,12,19],[8,9,8,11],[11,9,11,10],[11,6,11,7],[12,6,12,7],[12,9,12,10],[12,12,12,13],[10,24,10,25],[19,10,19,12],[18,6,18,9],[18,10,18,12],[18,13,18,16],[19,20,19,23],[14,3,14,4],[12,15,12,16],[5,10,5,11],[9,9,9,10],[8,12,8,14],[8,15,8,17],[11,15,11,16],[9,15,9,16],[10,12,10,13],[10,15,10,16],[20,3,20,5],[20,6,20,9],[19,17,19,19],[20,13,20,16],[22,17,22,19],[23,3,23,5],[23,6,23,9],[17,10,17,16],[15,3,15,4],[21,17,21,19],[19,13,19,16],[21,3,21,5],[21,6,21,9],[21,10,21,12],[21,13,21,16],[20,17,20,19],[20,10,20,12],[18,3,18,5],[18,17,18,19],[17,3,17,9],[17,17,17,23],[18,20,18,23],[19,3,19,5],[19,6,19,9],[20,20,20,23],[24,17,24,19],[24,20,24,23],[23,17,23,19],[24,10,24,12],[24,13,24,16],[25,17,25,19],[25,20,25,23],[23,10,23,12],[23,13,23,16],[22,10,22,12],[22,13,22,16],[25,3,25,5],[25,6,25,9],[25,10,25,12],[25,13,25,16],[24,3,24,5],[24,6,24,9],[23,20,23,23],[22,20,22,23],[21,20,21,23],[22,3,22,5],[22,6,22,9]]}
[]
["対抗戦名称",null,null,"第",16,"回","和奈滋",null,"対抗戦"]
[]
["開催日",null,null,"2018-11-18"]
[]
["会場",null,null,"キングスポット",null,null,null,null,null,"（","奈良",null,"）"]
[]
["出場選手"]
["前回","チーム",null,1,null,null,2,null,null,3,null,null,4,null,null,5,null,null,6,null,null,7,null,null,8]
["順位",null,null,"選手名",null,"点数","選手名",null,"点数","選手名",null,"点数","選手名",null,"点数","選手名",null,"点数","選手名",null,"点数","選手名",null,"点数","選手名",null,"点数"]
[3,"NRC",null,"斉藤",null,180,"山田",null,180,"吉向",null,180,"白戸",null,180,"植田",null,180,"岩本",null,180,"白戸",null,140,null,null,180]
[2,"WRC",null,"和田",null,180,"山中",null,180,"末岡",null,180,"杉本",null,180,"大迫",null,180,"中本",null,180,"松房",null,140,null,null,140]
[1,"SBC",null,"大橋",null,180,"西峰",null,180,"林",null,180,"秋田",null,180,"山中",null,180,"柳川",null,180,"大橋",null,140,null,null,140]
[]
["点数",null,null,"男性",null,"：","M",null,180,"点"]
[null,null,null,"女性",null,"：","W",null,140,"点"]
[]
[null,null,null,"SBC",null,null,null,null,null,null,"WRC",null,null,null,null,null,null,"NRC"]
[null,null,1,"大橋　義治",null,null,"おおはし　よしはる",null,null,null,"和田　宗一郎",null,null,"わだ　そういちろう",null,null,null,"斉藤　裕児",null,null,"さいとう　ゆうじ"]
[null,null,2,"西峰　久祐",null,null,"にしみね　ひさのり",null,null,null,"山中　康介",null,null,"やまなか　こうすけ",null,null,null,"山田　晃司",null,null,"やまだ　こうじ"]
[null,null,3,"林　秀忠",null,null,"はやし　ひでただ",null,null,null,"末岡　修",null,null,"すえおか　おさむ",null,null,null,"吉向　翔平",null,null,"きっこう　しょうへい"]
[null,null,4,"秋田　倫央",null,null,"あきた　みちお",null,null,null,"杉本　博章",null,null,"すぎもと　ひろあき",null,null,null,"白戸　玲人",null,null,"しらと　れいにん"]
[null,null,5,"山中　康寛",null,null,"やまなか　やすひろ",null,null,null,"大迫　忠典",null,null,"おおさこ　ただのり",null,null,null,"植田　慎也",null,null,"うえだ　しんや"]
[null,null,6,"柳川　哲也",null,null,"やながわ　てつや",null,null,null,"中本　雅大",null,null,"なかもと　まさひろ",null,null,null,"岩本　剛",null,null,"いわもと　つよし"]
[null,null,7,"大橋　洋子",null,null,"おおはし　ようこ",null,null,null,"松房　ゆかり",null,null,"まつふさ　ゆかり",null,null,null,"白戸　恭子",null,null,"しらと　きょうこ"]
[null,null,8]

{"sheet":"【準備】対戦カード","index":1,"n_rows":105,"n_cols":72,"rows_kept":105,"cut":false,"hidden":false,"merged":[]}
[null,null,null,null,null,null,null,null,null," ",{"$f":"【結果】個人成績表!$A$1","v":"第16回　和奈滋対抗戦　　　(奈良；キングスポット)"}]
[]
[null,"印刷範囲の設定",null,null,null,null,null,null,null,null,"G-No",null,null,null,"T-No"]
[]
[null,null,null,null,null,null,null,null,null,null,null,null,null,"所属"]
[null,null,null,null,null,null,null,null,null,null,null,null,null,"氏名"]
[null,null,null,null,null,null,null,null,null,null,null,null,null,"得点"]
[null,null,null,null,null,null,null,null,null,null,null,null,null,"HR"]
[]
[null,null,null,null,null,null,null,null,null,null,null,null,null,null,"レフリー"]
[null,{"$f":"【結果】個人成績表!$A$1","v":"第16回　和奈滋対抗戦　　　(奈良；キングスポット)"},null,null,null,null,null,null,null,null,{"$f":"【結果】個人成績表!$A$1","v":"第16回　和奈滋対抗戦　　　(奈良；キングスポット)"},null,null,null,null,null,null,null,null,{"$f":"【結果】個人成績表!$A$1","v":"第16回　和奈滋対抗戦　　　(奈良；キングスポット)"},null,null,null,null,null,null,null,null,{"$f":"【結果】個人成績表!$A$1","v":"第16回　和奈滋対抗戦　　　(奈良；キングスポット)"},null,null,null,null,null,null,null,null,{"$f":"【結果】個人成績表!$A$1","v":"第16回　和奈滋対抗戦　　　(奈良；キングスポット)"},null,null,null,null,null,null,null,null,{"$f":"【結果】個人成績表!$A$1","v":"第16回　和奈滋対抗戦　　　(奈良；キングスポット)"},null,null,null,null,null,null,null,null,{"$f":"【結果】個人成績表!$A$1","v":"第16回　和奈滋対抗戦　　　(奈良；キングスポット)"},null,null,null,null,null,null,null,null,{"$f":"【結果】個人成績表!$A$1","v":"第16回　和奈滋対抗戦　　　(奈良；キングスポット)"},null,null,null,null,null,null," "]
[]
[null,"G-No",{"$f":"【進行】結果入力表!B7","v":1},null,null,"T-No",null,null,null,null,"G-No",{"$f":"【進行】結果入力表!B8","v":2},null,null,"T-No",null,null,null,null,"G-No",{"$f":"【進行】結果入力表!B9","v":3},null,null,"T-No",null,null,null,null,"G-No",{"$f":"【進行】結果入力表!B10","v":4},null,null,"T-No",null,null,null,null,"G-No",{"$f":"【進行】結果入力表!B11","v":5},null,null,"T-No",null,null,null,null,"G-No",{"$f":"【進行】結果入力表!B12","v":6},null,null,"T-No",null,null,null,null,"G-No",{"$f":"【進行】結果入力表!B13","v":7},null,null,"T-No",null,null,null,null,"G-No",{"$f":"【進行】結果入力表!B14","v":""},null,null,"T-No"]
[]
[null,{"$f":"VLOOKUP(C13,【進行】結果入力表!$B$7:$J$78,2,FALSE)","v":"NRC"},null,null,"所属",{"$f":"VLOOKUP(C13,【進行】結果入力表!$B$7:$J$78,9,FALSE)","v":"SBC"},null,null,null,null,{"$f":"VLOOKUP(L13,【進行】結果入力表!$B$7:$J$78,2,FALSE)","v":"NRC"},null,null,"所属",{"$f":"VLOOKUP(L13,【進行】結果入力表!$B$7:$J$78,9,FALSE)","v":"SBC"},null,null,null,null,{"$f":"VLOOKUP(U13,【進行】結果入力表!$B$7:$J$78,2,FALSE)","v":"NRC"},null,null,"所属",{"$f":"VLOOKUP(U13,【進行】結果入力表!$B$7:$J$78,9,FALSE)","v":"SBC"},null,null,null,null,{"$f":"VLOOKUP(AD13,【進行】結果入力表!$B$7:$J$78,2,FALSE)","v":"NRC"},null,null,"所属",{"$f":"VLOOKUP(AD13,【進行】結果入力表!$B$7:$J$78,9,FALSE)","v":"SBC"},null,null,null,null,{"$f":"VLOOKUP(AM13,【進行】結果入力表!$B$7:$J$78,2,FALSE)","v":"NRC"},null,null,"所属",{"$f":"VLOOKUP(AM13,【進行】結果入力表!$B$7:$J$78,9,FALSE)","v":"SBC"},null,null,null,null,{"$f":"VLOOKUP(AV13,【進行】結果入力表!$B$7:$J$78,2,FALSE)","v":"NRC"},null,null,"所属",{"$f":"VLOOKUP(AV13,【進行】結果入力表!$B$7:$J$78,9,FALSE)","v":"SBC"},null,null,null,null,{"$f":"VLOOKUP(BE13,【進行】結果入力表!$B$7:$J$78,2,FALSE)","v":"NRC"},null,null,"所属",{"$f":"VLOOKUP(BE13,【進行】結果入力表!$B$7:$J$78,9,FALSE)","v":"SBC"},null,null,null,null,{"$f":"VLOOKUP(BN13,【進行】結果入力表!$B$7:$J$78,2,FALSE)","v":"NRC"},null,null,"所属",{"$f":"VLOOKUP(BN13,【進行】結果入力表!$B$7:$J$78,9,FALSE)","v":"SBC"}]
[null,{"$f":"VLOOKUP(C13,【進行】結果入力表!$B$7:$J$78,3,FALSE)","v":"斉藤"},null,null,"氏名",{"$f":"VLOOKUP(C13,【進行】結果入力表!$B$7:$J$78,8,FALSE)","v":"大橋"},null,null,null,null,{"$f":"VLOOKUP(L13,【進行】結果入力表!$B$7:$J$78,3,FALSE)","v":"山田"},null,null,"氏名",{"$f":"VLOOKUP(L13,【進行】結果入力表!$B$7:$J$78,8,FALSE)","v":"西峰"},null,null,null,null,{"$f":"VLOOKUP(U13,【進行】結果入力表!$B$7:$J$78,3,FALSE)","v":"吉向"},null,null,"氏名",{"$f":"VLOOKUP(U13,【進行】結果入力表!$B$7:$J$78,8,FALSE)","v":"林"},null,null,null,null,{"$f":"VLOOKUP(AD13,【進行】結果入力表!$B$7:$J$78,3,FALSE)","v":"白戸"},null,null,"氏名",{"$f":"VLOOKUP(AD13,【進行】結果入力表!$B$7:$J$78,8,FALSE)","v":"秋田"},null,null,null,null,{"$f":"VLOOKUP(AM13,【進行】結果入力表!$B$7:$J$78,3,FALSE)","v":"植田"},null,null,"氏名",{"$f":"VLOOKUP(AM13,【進行】結果入力表!$B$7:$J$78,8,FALSE)","v":"山中"},null,null,null,null,{"$f":"VLOOKUP(AV13,【進行】結果入力表!$B$7:$J$78,3,FALSE)","v":"岩本"},null,null,"氏名",{"$f":"VLOOKUP(AV13,【進行】結果入力表!$B$7:$J$78,8,FALSE)","v":"柳川"},null,null,null,null,{"$f":"VLOOKUP(BE13,【進行】結果入力表!$B$7:$J$78,3,FALSE)","v":"白戸"},null,null,"氏名",{"$f":"VLOOKUP(BE13,【進行】結果入力表!$B$7:$J$78,8,FALSE)","v":"大橋"},null,null,null,null,{"$f":"VLOOKUP(BN13,【進行】結果入力表!$B$7:$J$78,3,FALSE)","v":""},null,null,"氏名",{"$f":"VLOOKUP(BN13,【進行】結果入力表!$B$7:$J$78,8,FALSE)","v":""}]
[null,null,null,null,"得点",null,null,null,null,null,null,null,null,"得点",null,null,null,null,null,null,null,null,"得点",null,null,null,null,null,null,null,null,"得点",null,null,null,null,null,null,null,null,"得点",null,null,null,null,null,null,null,null,"得点",null,null,null,null,null,null,null,null,"得点",null,null,null,null,null,null,null,null,"得点"]
[null,null,null,null,"HR",null,null,null,null,null,null,null,null,"HR",null,null,null,null,null,null,null,null,"HR",null,null,null,null,null,null,null,null,"HR",null,null,null,null,null,null,null,null,"HR",null,null,null,null,null,null,null,null,"HR",null,null,null,null,null,null,null,null,"HR",null,null,null,null,null,null,null,null,"HR"]
[]
[null,null,null,null,"レフリー：",{"$f":"VLOOKUP(C13,【進行】結果入力表!$B$7:$M$78,11,FALSE)","v":"WRC"},{"$f":"VLOOKUP(C13,【進行】結果入力表!$B$7:$M$78,12,FALSE)","v":"和田"},null,null,null,null,null,null,"レフリー：",{"$f":"VLOOKUP(L13,【進行】結果入力表!$B$7:$M$78,11,FALSE)","v":"WRC"},{"$f":"VLOOKUP(L13,【進行】結果入力表!$B$7:$M$78,12,FALSE)","v":"山中"},null,null,null,null,null,null,"レフリー：",{"$f":"VLOOKUP(U13,【進行】結果入力表!$B$7:$M$78,11,FALSE)","v":"WRC"},{"$f":"VLOOKUP(U13,【進行】結果入力表!$B$7:$M$78,12,FALSE)","v":"末岡"},null,null,null,null,null,null,"レフリー：",{"$f":"VLOOKUP(AD13,【進行】結果入力表!$B$7:$M$78,11,FALSE)","v":"WRC"},{"$f":"VLOOKUP(AD13,【進行】結果入力表!$B$7:$M$78,12,FALSE)","v":"杉本"},null,null,null,null,null,null,"レフリー：",{"$f":"VLOOKUP(AM13,【進行】結果入力表!$B$7:$M$78,11,FALSE)","v":"WRC"},{"$f":"VLOOKUP(AM13,【進行】結果入力表!$B$7:$M$78,12,FALSE)","v":"大迫"},null,null,null,null,null,null,"レフリー：",{"$f":"VLOOKUP(AV13,【進行】結果入力表!$B$7:$M$78,11,FALSE)","v":"WRC"},{"$f":"VLOOKUP(AV13,【進行】結果入力表!$B$7:$M$78,12,FALSE)","v":"中本"},null,null,null,null,null,null,"レフリー：",{"$f":"VLOOKUP(BE13,【進行】結果入力表!$B$7:$M$78,11,FALSE)","v":"WRC"},{"$f":"VLOOKUP(BE13,【進行】結果入力表!$B$7:$M$78,12,FALSE)","v":"松房"},null,null,null,null,null,null,"レフリー：",{"$f":"VLOOKUP(BN13,【進行】結果入力表!$B$7:$M$78,11,FALSE)","v":"WRC"},{"$f":"VLOOKUP(BN13,【進行】結果入力表!$B$7:$M$78,12,FALSE)","v":""}]
[null,{"$f":"【結果】個人成績表!$A$1","v":"第16回　和奈滋対抗戦　　　(奈良；キングスポット)"},null,null,null,null,null,null,null,null,{"$f":"【結果】個人成績表!$A$1","v":"第16回　和奈滋対抗戦　　　(奈良；キングスポット)"},null,null,null,null,null,null,null,null,{"$f":"【結果】個人成績表!$A$1","v":"第16回　和奈滋対抗戦　　　(奈良；キングスポット)"},null,null,null,null,null,null,null,null,{"$f":"【結果】個人成績表!$A$1","v":"第16回　和奈滋対抗戦　　　(奈良；キングスポット)"},null,null,null,null,null,null,null,null,{"$f":"【結果】個人成績表!$A$1","v":"第16回　和奈滋対抗戦　　　(奈良；キングスポット)"},null,null,null,null,null,null,null,null,{"$f":"【結果】個人成績表!$A$1","v":"第16回　和奈滋対抗戦　　　(奈良；キングスポット)"},null,null,null,null,null,null,null,null,{"$f":"【結果】個人成績表!$A$1","v":"第16回　和奈滋対抗戦　　　(奈良；キングスポット)"},null,null,null,null,null,null,null,null,{"$f":"【結果】個人成績表!$A$1","v":"第16回　和奈滋対抗戦　　　(奈良；キングスポット)"},null,null,null,null,null,null," "]
[]
[null,"G-No",{"$f":"【進行】結果入力表!B15","v":8},null,null,"T-No",null,null,null,null,"G-No",{"$f":"【進行】結果入力表!B16","v":9},null,null,"T-No",null,null,null,null,"G-No",{"$f":"【進行】結果入力表!B17","v":10},null,null,"T-No",null,null,null,null,"G-No",{"$f":"【進行】結果入力表!B18","v":11},null,null,"T-No",null,null,null,null,"G-No",{"$f":"【進行】結果入力表!B19","v":12},null,null,"T-No",null,null,null,null,"G-No",{"$f":"【進行】結果入力表!B20","v":13},null,null,"T-No",null,null,null,null,"G-No",{"$f":"【進行】結果入力表!B21","v":14},null,null,"T-No",null,null,null,null,"G-No",{"$f":"【進行】結果入力表!B22","v":""},null,null,"T-No"]
[]
[null,{"$f":"VLOOKUP(C23,【進行】結果入力表!$B$7:$J$78,2,FALSE)","v":"NRC"},null,null,"所属",{"$f":"VLOOKUP(C23,【進行】結果入力表!$B$7:$J$78,9,FALSE)","v":"WRC"},null,null,null,null,{"$f":"VLOOKUP(L23,【進行】結果入力表!$B$7:$J$78,2,FALSE)","v":"NRC"},null,null,"所属",{"$f":"VLOOKUP(L23,【進行】結果入力表!$B$7:$J$78,9,FALSE)","v":"WRC"},null,null,null,null,{"$f":"VLOOKUP(U23,【進行】結果入力表!$B$7:$J$78,2,FALSE)","v":"NRC"},null,null,"所属",{"$f":"VLOOKUP(U23,【進行】結果入力表!$B$7:$J$78,9,FALSE)","v":"WRC"},null,null,null,null,{"$f":"VLOOKUP(AD23,【進行】結果入力表!$B$7:$J$78,2,FALSE)","v":"NRC"},null,null,"所属",{"$f":"VLOOKUP(AD23,【進行】結果入力表!$B$7:$J$78,9,FALSE)","v":"WRC"},null,null,null,null,{"$f":"VLOOKUP(AM23,【進行】結果入力表!$B$7:$J$78,2,FALSE)","v":"NRC"},null,null,"所属",{"$f":"VLOOKUP(AM23,【進行】結果入力表!$B$7:$J$78,9,FALSE)","v":"WRC"},null,null,null,null,{"$f":"VLOOKUP(AV23,【進行】結果入力表!$B$7:$J$78,2,FALSE)","v":"NRC"},null,null,"所属",{"$f":"VLOOKUP(AV23,【進行】結果入力表!$B$7:$J$78,9,FALSE)","v":"WRC"},null,null,null,null,{"$f":"VLOOKUP(BE23,【進行】結果入力表!$B$7:$J$78,2,FALSE)","v":"NRC"},null,null,"所属",{"$f":"VLOOKUP(BE23,【進行】結果入力表!$B$7:$J$78,9,FALSE)","v":"WRC"},null,null,null,null,{"$f":"VLOOKUP(BN23,【進行】結果入力表!$B$7:$J$78,2,FALSE)","v":"NRC"},null,null,"所属",{"$f":"VLOOKUP(BN23,【進行】結果入力表!$B$7:$J$78,9,FALSE)","v":"SBC"}]
[null,{"$f":"VLOOKUP(C23,【進行】結果入力表!$B$7:$J$78,3,FALSE)","v":"斉藤"},null,null,"氏名",{"$f":"VLOOKUP(C23,【進行】結果入力表!$B$7:$J$78,8,FALSE)","v":"和田"},null,null,null,null,{"$f":"VLOOKUP(L23,【進行】結果入力表!$B$7:$J$78,3,FALSE)","v":"山田"},null,null,"氏名",{"$f":"VLOOKUP(L23,【進行】結果入力表!$B$7:$J$78,8,FALSE)","v":"山中"},null,null,null,null,{"$f":"VLOOKUP(U23,【進行】結果入力表!$B$7:$J$78,3,FALSE)","v":"吉向"},null,null,"氏名",{"$f":"VLOOKUP(U23,【進行】結果入力表!$B$7:$J$78,8,FALSE)","v":"末岡"},null,null,null,null,{"$f":"VLOOKUP(AD23,【進行】結果入力表!$B$7:$J$78,3,FALSE)","v":"白戸"},null,null,"氏名",{"$f":"VLOOKUP(AD23,【進行】結果入力表!$B$7:$J$78,8,FALSE)","v":"杉本"},null,null,null,null,{"$f":"VLOOKUP(AM23,【進行】結果入力表!$B$7:$J$78,3,FALSE)","v":"植田"},null,null,"氏名",{"$f":"VLOOKUP(AM23,【進行】結果入力表!$B$7:$J$78,8,FALSE)","v":"大迫"},null,null,null,null,{"$f":"VLOOKUP(AV23,【進行】結果入力表!$B$7:$J$78,3,FALSE)","v":"岩本"},null,null,"氏名",{"$f":"VLOOKUP(AV23,【進行】結果入力表!$B$7:$J$78,8,FALSE)","v":"中本"},null,null,null,null,{"$f":"VLOOKUP(BE23,【進行】結果入力表!$B$7:$J$78,3,FALSE)","v":"白戸"},null,null,"氏名",{"$f":"VLOOKUP(BE23,【進行】結果入力表!$B$7:$J$78,8,FALSE)","v":"松房"},null,null,null,null,{"$f":"VLOOKUP(BN23,【進行】結果入力表!$B$7:$J$78,3,FALSE)","v":""},null,null,"氏名",{"$f":"VLOOKUP(BN23,【進行】結果入力表!$B$7:$J$78,8,FALSE)","v":""}]
[null,null,null,null,"得点",null,null,null,null,null,null,null,null,"得点",null,null,null,null,null,null,null,null,"得点",null,null,null,null,null,null,null,null,"得点",null,null,null,null,null,null,null,null,"得点",null,null,null,null,null,null,null,null,"得点",null,null,null,null,null,null,null,null,"得点",null,null,null,null,null,null,null,null,"得点"]
[null,null,null,null,"HR",null,null,null,null,null,null,null,null,"HR",null,null,null,null,null,null,null,null,"HR",null,null,null,null,null,null,null,null,"HR",null,null,null,null,null,null,null,null,"HR",null,null,null,null,null,null,null,null,"HR",null,null,null,null,null,null,null,null,"HR",null,null,null,null,null,null,null,null,"HR"]
[]
[null,null,null,null,"レフリー：",{"$f":"VLOOKUP(C23,【進行】結果入力表!$B$7:$M$78,11,FALSE)","v":"SBC"},{"$f":"VLOOKUP(C23,【進行】結果入力表!$B$7:$M$78,12,FALSE)","v":"大橋"},null,null,null,null,null,null,"レフリー：",{"$f":"VLOOKUP(L23,【進行】結果入力表!$B$7:$M$78,11,FALSE)","v":"SBC"},{"$f":"VLOOKUP(L23,【進行】結果入力表!$B$7:$M$78,12,FALSE)","v":"西峰"},null,null,null,null,null,null,"レフリー：",{"$f":"VLOOKUP(U23,【進行】結果入力表!$B$7:$M$78,11,FALSE)","v":"SBC"},{"$f":"VLOOKUP(U23,【進行】結果入力表!$B$7:$M$78,12,FALSE)","v":"林"},null,null,null,null,null,null,"レフリー：",{"$f":"VLOOKUP(AD23,【進行】結果入力表!$B$7:$M$78,11,FALSE)","v":"SBC"},{"$f":"VLOOKUP(AD23,【進行】結果入力表!$B$7:$M$78,12,FALSE)","v":"秋田"},null,null,null,null,null,null,"レフリー：",{"$f":"VLOOKUP(AM23,【進行】結果入力表!$B$7:$M$78,11,FALSE)","v":"SBC"},{"$f":"VLOOKUP(AM23,【進行】結果入力表!$B$7:$M$78,12,FALSE)","v":"山中"},null,null,null,null,null,null,"レフリー：",{"$f":"VLOOKUP(AV23,【進行】結果入力表!$B$7:$M$78,11,FALSE)","v":"SBC"},{"$f":"VLOOKUP(AV23,【進行】結果入力表!$B$7:$M$78,12,FALSE)","v":"柳川"},null,null,null,null,null,null,"レフリー：",{"$f":"VLOOKUP(BE23,【進行】結果入力表!$B$7:$M$78,11,FALSE)","v":"SBC"},{"$f":"VLOOKUP(BE23,【進行】結果入力表!$B$7:$M$78,12,FALSE)","v":"大橋"},null,null,null,null,null,null,"レフリー：",{"$f":"VLOOKUP(BN23,【進行】結果入力表!$B$7:$M$78,11,FALSE)","v":"WRC"},{"$f":"VLOOKUP(BN23,【進行】結果入力表!$B$7:$M$78,12,FALSE)","v":""}]
[null,{"$f":"【結果】個人成績表!$A$1","v":"第16回　和奈滋対抗戦　　　(奈良；キングスポット)"},null,null,null,null,null,null,null,null,{"$f":"【結果】個人成績表!$A$1","v":"第16回　和奈滋対抗戦　　　(奈良；キングスポット)"},null,null,null,null,null,null,null,null,{"$f":"【結果】個人成績表!$A$1","v":"第16回　和奈滋対抗戦　　　(奈良；キングスポット)"},null,null,null,null,null,null,null,null,{"$f":"【結果】個人成績表!$A$1","v":"第16回　和奈滋対抗戦　　　(奈良；キングスポット)"},null,null,null,null,null,null,null,null,{"$f":"【結果】個人成績表!$A$1","v":"第16回　和奈滋対抗戦　　　(奈良；キングスポット)"},null,null,null,null,null,null,null,null,{"$f":"【結果】個人成績表!$A$1","v":"第16回　和奈滋対抗戦　　　(奈良；キングスポット)"},null,null,null,null,null,null,null,null,{"$f":"【結果】個人成績表!$A$1","v":"第16回　和奈滋対抗戦　　　(奈良；キングスポット)"},null,null,null,null,null,null,null,null,{"$f":"【結果】個人成績表!$A$1","v":"第16回　和奈滋対抗戦　　　(奈良；キングスポット)"},null,null,null,null,null,null," "]
[]
[null,"G-No",{"$f":"【進行】結果入力表!B23","v":15},null,null,"T-No",null,null,null,null,"G-No",{"$f":"【進行】結果入力表!B24","v":16},null,null,"T-No",null,null,null,null,"G-No",{"$f":"【進行】結果入力表!B25","v":17},null,null,"T-No",null,null,null,null,"G-No",{"$f":"【進行】結果入力表!B26","v":18},null,null,"T-No",null,null,null,null,"G-No",{"$f":"【進行】結果入力表!B27","v":19},null,null,"T-No",null,null,null,null,"G-No",{"$f":"【進行】結果入力表!B28","v":20},null,null,"T-No",null,null,null,null,"G-No",{"$f":"【進行】結果入力表!B29","v":21},null,null,"T-No",null,null,null,null,"G-No",{"$f":"【進行】結果入力表!B30","v":""},null,null,"T-No"]
[]
[null,{"$f":"VLOOKUP(C33,【進行】結果入力表!$B$7:$J$78,2,FALSE)","v":"WRC"},null,null,"所属",{"$f":"VLOOKUP(C33,【進行】結果入力表!$B$7:$J$78,9,FALSE)","v":"SBC"},null,null,null,null,{"$f":"VLOOKUP(L33,【進行】結果入力表!$B$7:$J$78,2,FALSE)","v":"WRC"},null,null,"所属",{"$f":"VLOOKUP(L33,【進行】結果入力表!$B$7:$J$78,9,FALSE)","v":"SBC"},null,null,null,null,{"$f":"VLOOKUP(U33,【進行】結果入力表!$B$7:$J$78,2,FALSE)","v":"WRC"},null,null,"所属",{"$f":"VLOOKUP(U33,【進行】結果入力表!$B$7:$J$78,9,FALSE)","v":"SBC"},null,null,null,null,{"$f":"VLOOKUP(AD33,【進行】結果入力表!$B$7:$J$78,2,FALSE)","v":"WRC"},null,null,"所属",{"$f":"VLOOKUP(AD33,【進行】結果入力表!$B$7:$J$78,9,FALSE)","v":"SBC"},null,null,null,null,{"$f":"VLOOKUP(AM33,【進行】結果入力表!$B$7:$J$78,2,FALSE)","v":"WRC"},null,null,"所属",{"$f":"VLOOKUP(AM33,【進行】結果入力表!$B$7:$J$78,9,FALSE)","v":"SBC"},null,null,null,null,{"$f":"VLOOKUP(AV33,【進行】結果入力表!$B$7:$J$78,2,FALSE)","v":"WRC"},null,null,"所属",{"$f":"VLOOKUP(AV33,【進行】結果入力表!$B$7:$J$78,9,FALSE)","v":"SBC"},null,null,null,null,{"$f":"VLOOKUP(BE33,【進行】結果入力表!$B$7:$J$78,2,FALSE)","v":"WRC"},null,null,"所属",{"$f":"VLOOKUP(BE33,【進行】結果入力表!$B$7:$J$78,9,FALSE)","v":"SBC"},null,null,null,null,{"$f":"VLOOKUP(BN33,【進行】結果入力表!$B$7:$J$78,2,FALSE)","v":"NRC"},null,null,"所属",{"$f":"VLOOKUP(BN33,【進行】結果入力表!$B$7:$J$78,9,FALSE)","v":"SBC"}]
[null,{"$f":"VLOOKUP(C33,【進行】結果入力表!$B$7:$J$78,3,FALSE)","v":"和田"},null,null,"氏名",{"$f":"VLOOKUP(C33,【進行】結果入力表!$B$7:$J$78,8,FALSE)","v":"大橋"},null,null,null,null,{"$f":"VLOOKUP(L33,【進行】結果入力表!$B$7:$J$78,3,FALSE)","v":"山中"},null,null,"氏名",{"$f":"VLOOKUP(L33,【進行】結果入力表!$B$7:$J$78,8,FALSE)","v":"西峰"},null,null,null,null,{"$f":"VLOOKUP(U33,【進行】結果入力表!$B$7:$J$78,3,FALSE)","v":"末岡"},null,null,"氏名",{"$f":"VLOOKUP(U33,【進行】結果入力表!$B$7:$J$78,8,FALSE)","v":"林"},null,null,null,null,{"$f":"VLOOKUP(AD33,【進行】結果入力表!$B$7:$J$78,3,FALSE)","v":"杉本"},null,null,"氏名",{"$f":"VLOOKUP(AD33,【進行】結果入力表!$B$7:$J$78,8,FALSE)","v":"秋田"},null,null,null,null,{"$f":"VLOOKUP(AM33,【進行】結果入力表!$B$7:$J$78,3,FALSE)","v":"大迫"},null,null,"氏名",{"$f":"VLOOKUP(AM33,【進行】結果入力表!$B$7:$J$78,8,FALSE)","v":"山中"},null,null,null,null,{"$f":"VLOOKUP(AV33,【進行】結果入力表!$B$7:$J$78,3,FALSE)","v":"中本"},null,null,"氏名",{"$f":"VLOOKUP(AV33,【進行】結果入力表!$B$7:$J$78,8,FALSE)","v":"柳川"},null,null,null,null,{"$f":"VLOOKUP(BE33,【進行】結果入力表!$B$7:$J$78,3,FALSE)","v":"松房"},null,null,"氏名",{"$f":"VLOOKUP(BE33,【進行】結果入力表!$B$7:$J$78,8,FALSE)","v":"大橋"},null,null,null,null,{"$f":"VLOOKUP(BN33,【進行】結果入力表!$B$7:$J$78,3,FALSE)","v":""},null,null,"氏名",{"$f":"VLOOKUP(BN33,【進行】結果入力表!$B$7:$J$78,8,FALSE)","v":""}]
[null,null,null,null,"得点",null,null,null,null,null,null,null,null,"得点",null,null,null,null,null,null,null,null,"得点",null,null,null,null,null,null,null,null,"得点",null,null,null,null,null,null,null,null,"得点",null,null,null,null,null,null,null,null,"得点",null,null,null,null,null,null,null,null,"得点",null,null,null,null,null,null,null,null,"得点"]
[null,null,null,null,"HR",null,null,null,null,null,null,null,null,"HR",null,null,null,null,null,null,null,null,"HR",null,null,null,null,null,null,null,null,"HR",null,null,null,null,null,null,null,null,"HR",null,null,null,null,null,null,null,null,"HR",null,null,null,null,null,null,null,null,"HR",null,null,null,null,null,null,null,null,"HR"]
[]
[null,null,null,null,"レフリー：",{"$f":"VLOOKUP(C33,【進行】結果入力表!$B$7:$M$78,11,FALSE)","v":"NRC"},{"$f":"VLOOKUP(C33,【進行】結果入力表!$B$7:$M$78,12,FALSE)","v":"斉藤"},null,null,null,null,null,null,"レフリー：",{"$f":"VLOOKUP(L33,【進行】結果入力表!$B$7:$M$78,11,FALSE)","v":"NRC"},{"$f":"VLOOKUP(L33,【進行】結果入力表!$B$7:$M$78,12,FALSE)","v":"山田"},null,null,null,null,null,null,"レフリー：",{"$f":"VLOOKUP(U33,【進行】結果入力表!$B$7:$M$78,11,FALSE)","v":"NRC"},{"$f":"VLOOKUP(U33,【進行】結果入力表!$B$7:$M$78,12,FALSE)","v":"吉向"},null,null,null,null,null,null,"レフリー：",{"$f":"VLOOKUP(AD33,【進行】結果入力表!$B$7:$M$78,11,FALSE)","v":"NRC"},{"$f":"VLOOKUP(AD33,【進行】結果入力表!$B$7:$M$78,12,FALSE)","v":"白戸"},null,null,null,null,null,null,"レフリー：",{"$f":"VLOOKUP(AM33,【進行】結果入力表!$B$7:$M$78,11,FALSE)","v":"NRC"},{"$f":"VLOOKUP(AM33,【進行】結果入力表!$B$7:$M$78,12,FALSE)","v":"植田"},null,null,null,null,null,null,"レフリー：",{"$f":"VLOOKUP(AV33,【進行】結果入力表!$B$7:$M$78,11,FALSE)","v":"NRC"},{"$f":"VLOOKUP(AV33,【進行】結果入力表!$B$7:$M$78,12,FALSE)","v":"岩本"},null,null,null,null,null,null,"レフリー：",{"$f":"VLOOKUP(BE33,【進行】結果入力表!$B$7:$M$78,11,FALSE)","v":"NRC"},{"$f":"VLOOKUP(BE33,【進行】結果入力表!$B$7:$M$78,12,FALSE)","v":"白戸"},null,null,null,null,null,null,"レフリー：",{"$f":"VLOOKUP(BN33,【進行】結果入力表!$B$7:$M$78,11,FALSE)","v":"WRC"},{"$f":"VLOOKUP(BN33,【進行】結果入力表!$B$7:$M$78,12,FALSE)","v":""}]
[null,{"$f":"【結果】個人成績表!$A$1","v":"第16回　和奈滋対抗戦　　　(奈良；キングスポット)"},null,null,null,null,null,null,null,null,{"$f":"【結果】個人成績表!$A$1","v":"第16回　和奈滋対抗戦　　　(奈良；キングスポット)"},null,null,null,null,null,null,null,null,{"$f":"【結果】個人成績表!$A$1","v":"第16回　和奈滋対抗戦　　　(奈良；キングスポット)"},null,null,null,null,null,null,null,null,{"$f":"【結果】個人成績表!$A$1","v":"第16回　和奈滋対抗戦　　　(奈良；キングスポット)"},null,null,null,null,null,null,null,null,{"$f":"【結果】個人成績表!$A$1","v":"第16回　和奈滋対抗戦　　　(奈良；キングスポット)"},null,null,null,null,null,null,null,null,{"$f":"【結果】個人成績表!$A$1","v":"第16回　和奈滋対抗戦　　　(奈良；キングスポット)"},null,null,null,null,null,null,null,null,{"$f":"【結果】個人成績表!$A$1","v":"第16回　和奈滋対抗戦　　　(奈良；キングスポット)"},null,null,null,null,null,null,null,null,{"$f":"【結果】個人成績表!$A$1","v":"第16回　和奈滋対抗戦　　　(奈良；キングスポット)"},null,null,null,null,null,null," "]
[]
[null,"G-No",{"$f":"【進行】結果入力表!B31","v":22},null,null,"T-No",null,null,null,null,"G-No",{"$f":"【進行】結果入力表!B32","v":23},null,null,"T-No",null,null,null,null,"G-No",{"$f":"【進行】結果入力表!B33","v":24},null,null,"T-No",null,null,null,null,"G-No",{"$f":"【進行】結果入力表!B34","v":25},null,null,"T-No",null,null,null,null,"G-No",{"$f":"【進行】結果入力表!B35","v":26},null,null,"T-No",null,null,null,null,"G-No",{"$f":"【進行】結果入力表!B36","v":27},null,null,"T-No",null,null,null,null,"G-No",{"$f":"【進行】結果入力表!B37","v":28},null,null,"T-No",null,null,null,null,"G-No",{"$f":"【進行】結果入力表!B38","v":""},null,null,"T-No"]
[]
[null,{"$f":"VLOOKUP(C43,【進行】結果入力表!$B$7:$J$78,2,FALSE)","v":"NRC"},null,null,"所属",{"$f":"VLOOKUP(C43,【進行】結果入力表!$B$7:$J$78,9,FALSE)","v":"SBC"},null,null,null,null,{"$f":"VLOOKUP(L43,【進行】結果入力表!$B$7:$J$78,2,FALSE)","v":"NRC"},null,null,"所属",{"$f":"VLOOKUP(L43,【進行】結果入力表!$B$7:$J$78,9,FALSE)","v":"SBC"},null,null,null,null,{"$f":"VLOOKUP(U43,【進行】結果入力表!$B$7:$J$78,2,FALSE)","v":"NRC"},null,null,"所属",{"$f":"VLOOKUP(U43,【進行】結果入力表!$B$7:$J$78,9,FALSE)","v":"SBC"},null,null,null,null,{"$f":"VLOOKUP(AD43,【進行】結果入力表!$B$7:$J$78,2,FALSE)","v":"NRC"},null,null,"所属",{"$f":"VLOOKUP(AD43,【進行】結果入力表!$B$7:$J$78,9,FALSE)","v":"SBC"},null,null,null,null,{"$f":"VLOOKUP(AM43,【進行】結果入力表!$B$7:$J$78,2,FALSE)","v":"NRC"},null,null,"所属",{"$f":"VLOOKUP(AM43,【進行】結果入力表!$B$7:$J$78,9,FALSE)","v":"SBC"},null,null,null,null,{"$f":"VLOOKUP(AV43,【進行】結果入力表!$B$7:$J$78,2,FALSE)","v":"NRC"},null,null,"所属",{"$f":"VLOOKUP(AV43,【進行】結果入力表!$B$7:$J$78,9,FALSE)","v":"SBC"},null,null,null,null,{"$f":"VLOOKUP(BE43,【進行】結果入力表!$B$7:$J$78,2,FALSE)","v":"NRC"},null,null,"所属",{"$f":"VLOOKUP(BE43,【進行】結果入力表!$B$7:$J$78,9,FALSE)","v":"SBC"},null,null,null,null,{"$f":"VLOOKUP(BN43,【進行】結果入力表!$B$7:$J$78,2,FALSE)","v":"NRC"},null,null,"所属",{"$f":"VLOOKUP(BN43,【進行】結果入力表!$B$7:$J$78,9,FALSE)","v":"SBC"}]
[null,{"$f":"VLOOKUP(C43,【進行】結果入力表!$B$7:$J$78,3,FALSE)","v":"岩本"},null,null,"氏名",{"$f":"VLOOKUP(C43,【進行】結果入力表!$B$7:$J$78,8,FALSE)","v":"大橋"},null,null,null,null,{"$f":"VLOOKUP(L43,【進行】結果入力表!$B$7:$J$78,3,FALSE)","v":"白戸"},null,null,"氏名",{"$f":"VLOOKUP(L43,【進行】結果入力表!$B$7:$J$78,8,FALSE)","v":"西峰"},null,null,null,null,{"$f":"VLOOKUP(U43,【進行】結果入力表!$B$7:$J$78,3,FALSE)","v":"斉藤"},null,null,"氏名",{"$f":"VLOOKUP(U43,【進行】結果入力表!$B$7:$J$78,8,FALSE)","v":"林"},null,null,null,null,{"$f":"VLOOKUP(AD43,【進行】結果入力表!$B$7:$J$78,3,FALSE)","v":"山田"},null,null,"氏名",{"$f":"VLOOKUP(AD43,【進行】結果入力表!$B$7:$J$78,8,FALSE)","v":"秋田"},null,null,null,null,{"$f":"VLOOKUP(AM43,【進行】結果入力表!$B$7:$J$78,3,FALSE)","v":"吉向"},null,null,"氏名",{"$f":"VLOOKUP(AM43,【進行】結果入力表!$B$7:$J$78,8,FALSE)","v":"山中"},null,null,null,null,{"$f":"VLOOKUP(AV43,【進行】結果入力表!$B$7:$J$78,3,FALSE)","v":"白戸"},null,null,"氏名",{"$f":"VLOOKUP(AV43,【進行】結果入力表!$B$7:$J$78,8,FALSE)","v":"柳川"},null,null,null,null,{"$f":"VLOOKUP(BE43,【進行】結果入力表!$B$7:$J$78,3,FALSE)","v":"植田"},null,null,"氏名",{"$f":"VLOOKUP(BE43,【進行】結果入力表!$B$7:$J$78,8,FALSE)","v":"大橋"},null,null,null,null,{"$f":"VLOOKUP(BN43,【進行】結果入力表!$B$7:$J$78,3,FALSE)","v":""},null,null,"氏名",{"$f":"VLOOKUP(BN43,【進行】結果入力表!$B$7:$J$78,8,FALSE)","v":""}]
[null,null,null,null,"得点",null,null,null,null,null,null,null,null,"得点",null,null,null,null,null,null,null,null,"得点",null,null,null,null,null,null,null,null,"得点",null,null,null,null,null,null,null,null,"得点",null,null,null,null,null,null,null,null,"得点",null,null,null,null,null,null,null,null,"得点",null,null,null,null,null,null,null,null,"得点"]
[null,null,null,null,"HR",null,null,null,null,null,null,null,null,"HR",null,null,null,null,null,null,null,null,"HR",null,null,null,null,null,null,null,null,"HR",null,null,null,null,null,null,null,null,"HR",null,null,null,null,null,null,null,null,"HR",null,null,null,null,null,null,null,null,"HR",null,null,null,null,null,null,null,null,"HR"]
[]
[null,null,null,null,"レフリー：",{"$f":"VLOOKUP(C43,【進行】結果入力表!$B$7:$M$78,11,FALSE)","v":"WRC"},{"$f":"VLOOKUP(C43,【進行】結果入力表!$B$7:$M$78,12,FALSE)","v":"松房"},null,null,null,null,null,null,"レフリー：",{"$f":"VLOOKUP(L43,【進行】結果入力表!$B$7:$M$78,11,FALSE)","v":"WRC"},{"$f":"VLOOKUP(L43,【進行】結果入力表!$B$7:$M$78,12,FALSE)","v":"和田"},null,null,null,null,null,null,"レフリー：",{"$f":"VLOOKUP(U43,【進行】結果入力表!$B$7:$M$78,11,FALSE)","v":"WRC"},{"$f":"VLOOKUP(U43,【進行】結果入力表!$B$7:$M$78,12,FALSE)","v":"山中"},null,null,null,null,null,null,"レフリー：",{"$f":"VLOOKUP(AD43,【進行】結果入力表!$B$7:$M$78,11,FALSE)","v":"WRC"},{"$f":"VLOOKUP(AD43,【進行】結果入力表!$B$7:$M$78,12,FALSE)","v":"末岡"},null,null,null,null,null,null,"レフリー：",{"$f":"VLOOKUP(AM43,【進行】結果入力表!$B$7:$M$78,11,FALSE)","v":"WRC"},{"$f":"VLOOKUP(AM43,【進行】結果入力表!$B$7:$M$78,12,FALSE)","v":"杉本"},null,null,null,null,null,null,"レフリー：",{"$f":"VLOOKUP(AV43,【進行】結果入力表!$B$7:$M$78,11,FALSE)","v":"WRC"},{"$f":"VLOOKUP(AV43,【進行】結果入力表!$B$7:$M$78,12,FALSE)","v":"大迫"},null,null,null,null,null,null,"レフリー：",{"$f":"VLOOKUP(BE43,【進行】結果入力表!$B$7:$M$78,11,FALSE)","v":"WRC"},{"$f":"VLOOKUP(BE43,【進行】結果入力表!$B$7:$M$78,12,FALSE)","v":"中本"},null,null,null,null,null,null,"レフリー：",{"$f":"VLOOKUP(BN43,【進行】結果入力表!$B$7:$M$78,11,FALSE)","v":"WRC"},{"$f":"VLOOKUP(BN43,【進行】結果入力表!$B$7:$M$78,12,FALSE)","v":""}]
[null,{"$f":"【結果】個人成績表!$A$1","v":"第16回　和奈滋対抗戦　　　(奈良；キングスポット)"},null,null,null,null,null,null,null,null,{"$f":"【結果】個人成績表!$A$1","v":"第16回　和奈滋対抗戦　　　(奈良；キングスポット)"},null,null,null,null,null,null,null,null,{"$f":"【結果】個人成績表!$A$1","v":"第16回　和奈滋対抗戦　　　(奈良；キングスポット)"},null,null,null,null,null,null,null,null,{"$f":"【結果】個人成績表!$A$1","v":"第16回　和奈滋対抗戦　　　(奈良；キングスポット)"},null,null,null,null,null,null,null,null,{"$f":"【結果】個人成績表!$A$1","v":"第16回　和奈滋対抗戦　　　(奈良；キングスポット)"},null,null,null,null,null,null,null,null,{"$f":"【結果】個人成績表!$A$1","v":"第16回　和奈滋対抗戦　　　(奈良；キングスポット)"},null,null,null,null,null,null,null,null,{"$f":"【結果】個人成績表!$A$1","v":"第16回　和奈滋対抗戦　　　(奈良；キングスポット)"},null,null,null,null,null,null,null,null,{"$f":"【結果】個人成績表!$A$1","v":"第16回　和奈滋対抗戦　　　(奈良；キングスポット)"},null,null,null,null,null,null," "]
[]
[null,"G-No",{"$f":"【進行】結果入力表!B39","v":29},null,null,"T-No",null,null,null,null,"G-No",{"$f":"【進行】結果入力表!B40","v":30},null,null,"T-No",null,null,null,null,"G-No",{"$f":"【進行】結果入力表!B41","v":31},null,null,"T-No",null,null,null,null,"G-No",{"$f":"【進行】結果入力表!B42","v":32},null,null,"T-No",null,null,null,null,"G-No",{"$f":"【進行】結果入力表!B43","v":33},null,null,"T-No",null,null,null,null,"G-No",{"$f":"【進行】結果入力表!B44","v":34},null,null,"T-No",null,null,null,null,"G-No",{"$f":"【進行】結果入力表!B45","v":35},null,null,"T-No",null,null,null,null,"G-No",{"$f":"【進行】結果入力表!B46","v":""},null,null,"T-No"]
[]
[null,{"$f":"VLOOKUP(C53,【進行】結果入力表!$B$7:$J$78,2,FALSE)","v":"NRC"},null,null,"所属",{"$f":"VLOOKUP(C53,【進行】結果入力表!$B$7:$J$78,9,FALSE)","v":"WRC"},null,null,null,null,{"$f":"VLOOKUP(L53,【進行】結果入力表!$B$7:$J$78,2,FALSE)","v":"NRC"},null,null,"所属",{"$f":"VLOOKUP(L53,【進行】結果入力表!$B$7:$J$78,9,FALSE)","v":"WRC"},null,null,null,null,{"$f":"VLOOKUP(U53,【進行】結果入力表!$B$7:$J$78,2,FALSE)","v":"NRC"},null,null,"所属",{"$f":"VLOOKUP(U53,【進行】結果入力表!$B$7:$J$78,9,FALSE)","v":"WRC"},null,null,null,null,{"$f":"VLOOKUP(AD53,【進行】結果入力表!$B$7:$J$78,2,FALSE)","v":"NRC"},null,null,"所属",{"$f":"VLOOKUP(AD53,【進行】結果入力表!$B$7:$J$78,9,FALSE)","v":"WRC"},null,null,null,null,{"$f":"VLOOKUP(AM53,【進行】結果入力表!$B$7:$J$78,2,FALSE)","v":"NRC"},null,null,"所属",{"$f":"VLOOKUP(AM53,【進行】結果入力表!$B$7:$J$78,9,FALSE)","v":"WRC"},null,null,null,null,{"$f":"VLOOKUP(AV53,【進行】結果入力表!$B$7:$J$78,2,FALSE)","v":"NRC"},null,null,"所属",{"$f":"VLOOKUP(AV53,【進行】結果入力表!$B$7:$J$78,9,FALSE)","v":"WRC"},null,null,null,null,{"$f":"VLOOKUP(BE53,【進行】結果入力表!$B$7:$J$78,2,FALSE)","v":"NRC"},null,null,"所属",{"$f":"VLOOKUP(BE53,【進行】結果入力表!$B$7:$J$78,9,FALSE)","v":"WRC"},null,null,null,null,{"$f":"VLOOKUP(BN53,【進行】結果入力表!$B$7:$J$78,2,FALSE)","v":"NRC"},null,null,"所属",{"$f":"VLOOKUP(BN53,【進行】結果入力表!$B$7:$J$78,9,FALSE)","v":"SBC"}]
[null,{"$f":"VLOOKUP(C53,【進行】結果入力表!$B$7:$J$78,3,FALSE)","v":"岩本"},null,null,"氏名",{"$f":"VLOOKUP(C53,【進行】結果入力表!$B$7:$J$78,8,FALSE)","v":"松房"},null,null,null,null,{"$f":"VLOOKUP(L53,【進行】結果入力表!$B$7:$J$78,3,FALSE)","v":"白戸"},null,null,"氏名",{"$f":"VLOOKUP(L53,【進行】結果入力表!$B$7:$J$78,8,FALSE)","v":"和田"},null,null,null,null,{"$f":"VLOOKUP(U53,【進行】結果入力表!$B$7:$J$78,3,FALSE)","v":"斉藤"},null,null,"氏名",{"$f":"VLOOKUP(U53,【進行】結果入力表!$B$7:$J$78,8,FALSE)","v":"山中"},null,null,null,null,{"$f":"VLOOKUP(AD53,【進行】結果入力表!$B$7:$J$78,3,FALSE)","v":"山田"},null,null,"氏名",{"$f":"VLOOKUP(AD53,【進行】結果入力表!$B$7:$J$78,8,FALSE)","v":"末岡"},null,null,null,null,{"$f":"VLOOKUP(AM53,【進行】結果入力表!$B$7:$J$78,3,FALSE)","v":"吉向"},null,null,"氏名",{"$f":"VLOOKUP(AM53,【進行】結果入力表!$B$7:$J$78,8,FALSE)","v":"杉本"},null,null,null,null,{"$f":"VLOOKUP(AV53,【進行】結果入力表!$B$7:$J$78,3,FALSE)","v":"白戸"},null,null,"氏名",{"$f":"VLOOKUP(AV53,【進行】結果入力表!$B$7:$J$78,8,FALSE)","v":"大迫"},null,null,null,null,{"$f":"VLOOKUP(BE53,【進行】結果入力表!$B$7:$J$78,3,FALSE)","v":"植田"},null,null,"氏名",{"$f":"VLOOKUP(BE53,【進行】結果入力表!$B$7:$J$78,8,FALSE)","v":"中本"},null,null,null,null,{"$f":"VLOOKUP(BN53,【進行】結果入力表!$B$7:$J$78,3,FALSE)","v":""},null,null,"氏名",{"$f":"VLOOKUP(BN53,【進行】結果入力表!$B$7:$J$78,8,FALSE)","v":""}]
[null,null,null,null,"得点",null,null,null,null,null,null,null,null,"得点",null,null,null,null,null,null,null,null,"得点",null,null,null,null,null,null,null,null,"得点",null,null,null,null,null,null,null,null,"得点",null,null,null,null,null,null,null,null,"得点",null,null,null,null,null,null,null,null,"得点",null,null,null,null,null,null,null,null,"得点"]
[null,null,null,null,"HR",null,null,null,null,null,null,null,null,"HR",null,null,null,null,null,null,null,null,"HR",null,null,null,null,null,null,null,null,"HR",null,null,null,null,null,null,null,null,"HR",null,null,null,null,null,null,null,null,"HR",null,null,null,null,null,null,null,null,"HR",null,null,null,null,null,null,null,null,"HR"]
[]
[null,null,null,null,"レフリー：",{"$f":"VLOOKUP(C53,【進行】結果入力表!$B$7:$M$78,11,FALSE)","v":"SBC"},{"$f":"VLOOKUP(C53,【進行】結果入力表!$B$7:$M$78,12,FALSE)","v":"大橋"},null,null,null,null,null,null,"レフリー：",{"$f":"VLOOKUP(L53,【進行】結果入力表!$B$7:$M$78,11,FALSE)","v":"SBC"},{"$f":"VLOOKUP(L53,【進行】結果入力表!$B$7:$M$78,12,FALSE)","v":"西峰"},null,null,null,null,null,null,"レフリー：",{"$f":"VLOOKUP(U53,【進行】結果入力表!$B$7:$M$78,11,FALSE)","v":"SBC"},{"$f":"VLOOKUP(U53,【進行】結果入力表!$B$7:$M$78,12,FALSE)","v":"林"},null,null,null,null,null,null,"レフリー：",{"$f":"VLOOKUP(AD53,【進行】結果入力表!$B$7:$M$78,11,FALSE)","v":"SBC"},{"$f":"VLOOKUP(AD53,【進行】結果入力表!$B$7:$M$78,12,FALSE)","v":"秋田"},null,null,null,null,null,null,"レフリー：",{"$f":"VLOOKUP(AM53,【進行】結果入力表!$B$7:$M$78,11,FALSE)","v":"SBC"},{"$f":"VLOOKUP(AM53,【進行】結果入力表!$B$7:$M$78,12,FALSE)","v":"山中"},null,null,null,null,null,null,"レフリー：",{"$f":"VLOOKUP(AV53,【進行】結果入力表!$B$7:$M$78,11,FALSE)","v":"SBC"},{"$f":"VLOOKUP(AV53,【進行】結果入力表!$B$7:$M$78,12,FALSE)","v":"柳川"},null,null,null,null,null,null,"レフリー：",{"$f":"VLOOKUP(BE53,【進行】結果入力表!$B$7:$M$78,11,FALSE)","v":"SBC"},{"$f":"VLOOKUP(BE53,【進行】結果入力表!$B$7:$M$78,12,FALSE)","v":"大橋"},null,null,null,null,null,null,"レフリー：",{"$f":"VLOOKUP(BN53,【進行】結果入力表!$B$7:$M$78,11,FALSE)","v":"WRC"},{"$f":"VLOOKUP(BN53,【進行】結果入力表!$B$7:$M$78,12,FALSE)","v":""}]
[null,{"$f":"【結果】個人成績表!$A$1","v":"第16回　和奈滋対抗戦　　　(奈良；キングスポット)"},null,null,null,null,null,null,null,null,{"$f":"【結果】個人成績表!$A$1","v":"第16回　和奈滋対抗戦　　　(奈良；キングスポット)"},null,null,null,null,null,null,null,null,{"$f":"【結果】個人成績表!$A$1","v":"第16回　和奈滋対抗戦　　　(奈良；キングスポット)"},null,null,null,null,null,null,null,null,{"$f":"【結果】個人成績表!$A$1","v":"第16回　和奈滋対抗戦　　　(奈良；キングスポット)"},null,null,null,null,null,null,null,null,{"$f":"【結果】個人成績表!$A$1","v":"第16回　和奈滋対抗戦　　　(奈良；キングスポット)"},null,null,null,null,null,null,null,null,{"$f":"【結果】個人成績表!$A$1","v":"第16回　和奈滋対抗戦　　　(奈良；キングスポット)"},null,null,null,null,null,null,null,null,{"$f":"【結果】個人成績表!$A$1","v":"第16回　和奈滋対抗戦　　　(奈良；キングスポット)"},null,null,null,null,null,null,null,null,{"$f":"【結果】個人成績表!$A$1","v":"第16回　和奈滋対抗戦　　　(奈良；キングスポット)"},null,null,null,null,null,null," "]
[]
[null,"G-No",{"$f":"【進行】結果入力表!B47","v":36},null,null,"T-No",null,null,null,null,"G-No",{"$f":"【進行】結果入力表!B48","v":37},null,null,"T-No",null,null,null,null,"G-No",{"$f":"【進行】結果入力表!B49","v":38},null,null,"T-No",null,null,null,null,"G-No",{"$f":"【進行】結果入力表!B50","v":39},null,null,"T-No",null,null,null,null,"G-No",{"$f":"【進行】結果入力表!B51","v":40},null,null,"T-No",null,null,null,null,"G-No",{"$f":"【進行】結果入力表!B52","v":41},null,null,"T-No",null,null,null,null,"G-No",{"$f":"【進行】結果入力表!B53","v":42},null,null,"T-No",null,null,null,null,"G-No",{"$f":"【進行】結果入力表!B54","v":""},null,null,"T-No"]
[]
[null,{"$f":"VLOOKUP(C63,【進行】結果入力表!$B$7:$J$78,2,FALSE)","v":"WRC"},null,null,"所属",{"$f":"VLOOKUP(C63,【進行】結果入力表!$B$7:$J$78,9,FALSE)","v":"SBC"},null,null,null,null,{"$f":"VLOOKUP(L63,【進行】結果入力表!$B$7:$J$78,2,FALSE)","v":"WRC"},null,null,"所属",{"$f":"VLOOKUP(L63,【進行】結果入力表!$B$7:$J$78,9,FALSE)","v":"SBC"},null,null,null,null,{"$f":"VLOOKUP(U63,【進行】結果入力表!$B$7:$J$78,2,FALSE)","v":"WRC"},null,null,"所属",{"$f":"VLOOKUP(U63,【進行】結果入力表!$B$7:$J$78,9,FALSE)","v":"SBC"},null,null,null,null,{"$f":"VLOOKUP(AD63,【進行】結果入力表!$B$7:$J$78,2,FALSE)","v":"WRC"},null,null,"所属",{"$f":"VLOOKUP(AD63,【進行】結果入力表!$B$7:$J$78,9,FALSE)","v":"SBC"},null,null,null,null,{"$f":"VLOOKUP(AM63,【進行】結果入力表!$B$7:$J$78,2,FALSE)","v":"WRC"},null,null,"所属",{"$f":"VLOOKUP(AM63,【進行】結果入力表!$B$7:$J$78,9,FALSE)","v":"SBC"},null,null,null,null,{"$f":"VLOOKUP(AV63,【進行】結果入力表!$B$7:$J$78,2,FALSE)","v":"WRC"},null,null,"所属",{"$f":"VLOOKUP(AV63,【進行】結果入力表!$B$7:$J$78,9,FALSE)","v":"SBC"},null,null,null,null,{"$f":"VLOOKUP(BE63,【進行】結果入力表!$B$7:$J$78,2,FALSE)","v":"WRC"},null,null,"所属",{"$f":"VLOOKUP(BE63,【進行】結果入力表!$B$7:$J$78,9,FALSE)","v":"SBC"},null,null,null,null,{"$f":"VLOOKUP(BN63,【進行】結果入力表!$B$7:$J$78,2,FALSE)","v":"NRC"},null,null,"所属",{"$f":"VLOOKUP(BN63,【進行】結果入力表!$B$7:$J$78,9,FALSE)","v":"SBC"}]
[null,{"$f":"VLOOKUP(C63,【進行】結果入力表!$B$7:$J$78,3,FALSE)","v":"松房"},null,null,"氏名",{"$f":"VLOOKUP(C63,【進行】結果入力表!$B$7:$J$78,8,FALSE)","v":"大橋"},null,null,null,null,{"$f":"VLOOKUP(L63,【進行】結果入力表!$B$7:$J$78,3,FALSE)","v":"和田"},null,null,"氏名",{"$f":"VLOOKUP(L63,【進行】結果入力表!$B$7:$J$78,8,FALSE)","v":"西峰"},null,null,null,null,{"$f":"VLOOKUP(U63,【進行】結果入力表!$B$7:$J$78,3,FALSE)","v":"山中"},null,null,"氏名",{"$f":"VLOOKUP(U63,【進行】結果入力表!$B$7:$J$78,8,FALSE)","v":"林"},null,null,null,null,{"$f":"VLOOKUP(AD63,【進行】結果入力表!$B$7:$J$78,3,FALSE)","v":"末岡"},null,null,"氏名",{"$f":"VLOOKUP(AD63,【進行】結果入力表!$B$7:$J$78,8,FALSE)","v":"秋田"},null,null,null,null,{"$f":"VLOOKUP(AM63,【進行】結果入力表!$B$7:$J$78,3,FALSE)","v":"杉本"},null,null,"氏名",{"$f":"VLOOKUP(AM63,【進行】結果入力表!$B$7:$J$78,8,FALSE)","v":"山中"},null,null,null,null,{"$f":"VLOOKUP(AV63,【進行】結果入力表!$B$7:$J$78,3,FALSE)","v":"大迫"},null,null,"氏名",{"$f":"VLOOKUP(AV63,【進行】結果入力表!$B$7:$J$78,8,FALSE)","v":"柳川"},null,null,null,null,{"$f":"VLOOKUP(BE63,【進行】結果入力表!$B$7:$J$78,3,FALSE)","v":"中本"},null,null,"氏名",{"$f":"VLOOKUP(BE63,【進行】結果入力表!$B$7:$J$78,8,FALSE)","v":"大橋"},null,null,null,null,{"$f":"VLOOKUP(BN63,【進行】結果入力表!$B$7:$J$78,3,FALSE)","v":""},null,null,"氏名",{"$f":"VLOOKUP(BN63,【進行】結果入力表!$B$7:$J$78,8,FALSE)","v":""}]
[null,null,null,null,"得点",null,null,null,null,null,null,null,null,"得点",null,null,null,null,null,null,null,null,"得点",null,null,null,null,null,null,null,null,"得点",null,null,null,null,null,null,null,null,"得点",null,null,null,null,null,null,null,null,"得点",null,null,null,null,null,null,null,null,"得点",null,null,null,null,null,null,null,null,"得点"]
[null,null,null,null,"HR",null,null,null,null,null,null,null,null,"HR",null,null,null,null,null,null,null,null,"HR",null,null,null,null,null,null,null,null,"HR",null,null,null,null,null,null,null,null,"HR",null,null,null,null,null,null,null,null,"HR",null,null,null,null,null,null,null,null,"HR",null,null,null,null,null,null,null,null,"HR"]
[]
[null,null,null,null,"レフリー：",{"$f":"VLOOKUP(C63,【進行】結果入力表!$B$7:$M$78,11,FALSE)","v":"NRC"},{"$f":"VLOOKUP(C63,【進行】結果入力表!$B$7:$M$78,12,FALSE)","v":"岩本"},null,null,null,null,null,null,"レフリー：",{"$f":"VLOOKUP(L63,【進行】結果入力表!$B$7:$M$78,11,FALSE)","v":"NRC"},{"$f":"VLOOKUP(L63,【進行】結果入力表!$B$7:$M$78,12,FALSE)","v":"白戸"},null,null,null,null,null,null,"レフリー：",{"$f":"VLOOKUP(U63,【進行】結果入力表!$B$7:$M$78,11,FALSE)","v":"NRC"},{"$f":"VLOOKUP(U63,【進行】結果入力表!$B$7:$M$78,12,FALSE)","v":"斉藤"},null,null,null,null,null,null,"レフリー：",{"$f":"VLOOKUP(AD63,【進行】結果入力表!$B$7:$M$78,11,FALSE)","v":"NRC"},{"$f":"VLOOKUP(AD63,【進行】結果入力表!$B$7:$M$78,12,FALSE)","v":"山田"},null,null,null,null,null,null,"レフリー：",{"$f":"VLOOKUP(AM63,【進行】結果入力表!$B$7:$M$78,11,FALSE)","v":"NRC"},{"$f":"VLOOKUP(AM63,【進行】結果入力表!$B$7:$M$78,12,FALSE)","v":"吉向"},null,null,null,null,null,null,"レフリー：",{"$f":"VLOOKUP(AV63,【進行】結果入力表!$B$7:$M$78,11,FALSE)","v":"NRC"},{"$f":"VLOOKUP(AV63,【進行】結果入力表!$B$7:$M$78,12,FALSE)","v":"白戸"},null,null,null,null,null,null,"レフリー：",{"$f":"VLOOKUP(BE63,【進行】結果入力表!$B$7:$M$78,11,FALSE)","v":"NRC"},{"$f":"VLOOKUP(BE63,【進行】結果入力表!$B$7:$M$78,12,FALSE)","v":"植田"},null,null,null,null,null,null,"レフリー：",{"$f":"VLOOKUP(BN63,【進行】結果入力表!$B$7:$M$78,11,FALSE)","v":"WRC"},{"$f":"VLOOKUP(BN63,【進行】結果入力表!$B$7:$M$78,12,FALSE)","v":""}]
[null,{"$f":"【結果】個人成績表!$A$1","v":"第16回　和奈滋対抗戦　　　(奈良；キングスポット)"},null,null,null,null,null,null,null,null,{"$f":"【結果】個人成績表!$A$1","v":"第16回　和奈滋対抗戦　　　(奈良；キングスポット)"},null,null,null,null,null,null,null,null,{"$f":"【結果】個人成績表!$A$1","v":"第16回　和奈滋対抗戦　　　(奈良；キングスポット)"},null,null,null,null,null,null,null,null,{"$f":"【結果】個人成績表!$A$1","v":"第16回　和奈滋対抗戦　　　(奈良；キングスポット)"},null,null,null,null,null,null,null,null,{"$f":"【結果】個人成績表!$A$1","v":"第16回　和奈滋対抗戦　　　(奈良；キングスポット)"},null,null,null,null,null,null,null,null,{"$f":"【結果】個人成績表!$A$1","v":"第16回　和奈滋対抗戦　　　(奈良；キングスポット)"},null,null,null,null,null,null,null,null,{"$f":"【結果】個人成績表!$A$1","v":"第16回　和奈滋対抗戦　　　(奈良；キングスポット)"},null,null,null,null,null,null,null,null,{"$f":"【結果】個人成績表!$A$1","v":"第16回　和奈滋対抗戦　　　(奈良；キングスポット)"},null,null,null,null,null,null," "]
[]
[null,"G-No",{"$f":"【進行】結果入力表!B55","v":43},null,null,"T-No",null,null,null,null,"G-No",{"$f":"【進行】結果入力表!B56","v":44},null,null,"T-No",null,null,null,null,"G-No",{"$f":"【進行】結果入力表!B57","v":45},null,null,"T-No",null,null,null,null,"G-No",{"$f":"【進行】結果入力表!B58","v":46},null,null,"T-No",null,null,null,null,"G-No",{"$f":"【進行】結果入力表!B59","v":47},null,null,"T-No",null,null,null,null,"G-No",{"$f":"【進行】結果入力表!B60","v":48},null,null,"T-No",null,null,null,null,"G-No",{"$f":"【進行】結果入力表!B61","v":49},null,null,"T-No",null,null,null,null,"G-No",{"$f":"【進行】結果入力表!B62","v":""},null,null,"T-No"]
[]
[null,{"$f":"VLOOKUP(C73,【進行】結果入力表!$B$7:$J$78,2,FALSE)","v":"NRC"},null,null,"所属",{"$f":"VLOOKUP(C73,【進行】結果入力表!$B$7:$J$78,9,FALSE)","v":"SBC"},null,null,null,null,{"$f":"VLOOKUP(L73,【進行】結果入力表!$B$7:$J$78,2,FALSE)","v":"NRC"},null,null,"所属",{"$f":"VLOOKUP(L73,【進行】結果入力表!$B$7:$J$78,9,FALSE)","v":"SBC"},null,null,null,null,{"$f":"VLOOKUP(U73,【進行】結果入力表!$B$7:$J$78,2,FALSE)","v":"NRC"},null,null,"所属",{"$f":"VLOOKUP(U73,【進行】結果入力表!$B$7:$J$78,9,FALSE)","v":"SBC"},null,null,null,null,{"$f":"VLOOKUP(AD73,【進行】結果入力表!$B$7:$J$78,2,FALSE)","v":"NRC"},null,null,"所属",{"$f":"VLOOKUP(AD73,【進行】結果入力表!$B$7:$J$78,9,FALSE)","v":"SBC"},null,null,null,null,{"$f":"VLOOKUP(AM73,【進行】結果入力表!$B$7:$J$78,2,FALSE)","v":"NRC"},null,null,"所属",{"$f":"VLOOKUP(AM73,【進行】結果入力表!$B$7:$J$78,9,FALSE)","v":"SBC"},null,null,null,null,{"$f":"VLOOKUP(AV73,【進行】結果入力表!$B$7:$J$78,2,FALSE)","v":"NRC"},null,null,"所属",{"$f":"VLOOKUP(AV73,【進行】結果入力表!$B$7:$J$78,9,FALSE)","v":"SBC"},null,null,null,null,{"$f":"VLOOKUP(BE73,【進行】結果入力表!$B$7:$J$78,2,FALSE)","v":"NRC"},null,null,"所属",{"$f":"VLOOKUP(BE73,【進行】結果入力表!$B$7:$J$78,9,FALSE)","v":"SBC"},null,null,null,null,{"$f":"VLOOKUP(BN73,【進行】結果入力表!$B$7:$J$78,2,FALSE)","v":"NRC"},null,null,"所属",{"$f":"VLOOKUP(BN73,【進行】結果入力表!$B$7:$J$78,9,FALSE)","v":"SBC"}]
[null,{"$f":"VLOOKUP(C73,【進行】結果入力表!$B$7:$J$78,3,FALSE)","v":"白戸"},null,null,"氏名",{"$f":"VLOOKUP(C73,【進行】結果入力表!$B$7:$J$78,8,FALSE)","v":"大橋"},null,null,null,null,{"$f":"VLOOKUP(L73,【進行】結果入力表!$B$7:$J$78,3,FALSE)","v":"植田"},null,null,"氏名",{"$f":"VLOOKUP(L73,【進行】結果入力表!$B$7:$J$78,8,FALSE)","v":"西峰"},null,null,null,null,{"$f":"VLOOKUP(U73,【進行】結果入力表!$B$7:$J$78,3,FALSE)","v":"岩本"},null,null,"氏名",{"$f":"VLOOKUP(U73,【進行】結果入力表!$B$7:$J$78,8,FALSE)","v":"林"},null,null,null,null,{"$f":"VLOOKUP(AD73,【進行】結果入力表!$B$7:$J$78,3,FALSE)","v":"白戸"},null,null,"氏名",{"$f":"VLOOKUP(AD73,【進行】結果入力表!$B$7:$J$78,8,FALSE)","v":"秋田"},null,null,null,null,{"$f":"VLOOKUP(AM73,【進行】結果入力表!$B$7:$J$78,3,FALSE)","v":"斉藤"},null,null,"氏名",{"$f":"VLOOKUP(AM73,【進行】結果入力表!$B$7:$J$78,8,FALSE)","v":"山中"},null,null,null,null,{"$f":"VLOOKUP(AV73,【進行】結果入力表!$B$7:$J$78,3,FALSE)","v":"山田"},null,null,"氏名",{"$f":"VLOOKUP(AV73,【進行】結果入力表!$B$7:$J$78,8,FALSE)","v":"柳川"},null,null,null,null,{"$f":"VLOOKUP(BE73,【進行】結果入力表!$B$7:$J$78,3,FALSE)","v":"吉向"},null,null,"氏名",{"$f":"VLOOKUP(BE73,【進行】結果入力表!$B$7:$J$78,8,FALSE)","v":"大橋"},null,null,null,null,{"$f":"VLOOKUP(BN73,【進行】結果入力表!$B$7:$J$78,3,FALSE)","v":""},null,null,"氏名",{"$f":"VLOOKUP(BN73,【進行】結果入力表!$B$7:$J$78,8,FALSE)","v":""}]
[null,null,null,null,"得点",null,null,null,null,null,null,null,null,"得点",null,null,null,null,null,null,null,null,"得点",null,null,null,null,null,null,null,null,"得点",null,null,null,null,null,null,null,null,"得点",null,null,null,null,null,null,null,null,"得点",null,null,null,null,null,null,null,null,"得点",null,null,null,null,null,null,null,null,"得点"]
[null,null,null,null,"HR",null,null,null,null,null,null,null,null,"HR",null,null,null,null,null,null,null,null,"HR",null,null,null,null,null,null,null,null,"HR",null,null,null,null,null,null,null,null,"HR",null,null,null,null,null,null,null,null,"HR",null,null,null,null,null,null,null,null,"HR",null,null,null,null,null,null,null,null,"HR"]
[]
[null,null,null,null,"レフリー：",{"$f":"VLOOKUP(C73,【進行】結果入力表!$B$7:$M$78,11,FALSE)","v":"WRC"},{"$f":"VLOOKUP(C73,【進行】結果入力表!$B$7:$M$78,12,FALSE)","v":"中本"},null,null,null,null,null,null,"レフリー：",{"$f":"VLOOKUP(L73,【進行】結果入力表!$B$7:$M$78,11,FALSE)","v":"WRC"},{"$f":"VLOOKUP(L73,【進行】結果入力表!$B$7:$M$78,12,FALSE)","v":"松房"},null,null,null,null,null,null,"レフリー：",{"$f":"VLOOKUP(U73,【進行】結果入力表!$B$7:$M$78,11,FALSE)","v":"WRC"},{"$f":"VLOOKUP(U73,【進行】結果入力表!$B$7:$M$78,12,FALSE)","v":"和田"},null,null,null,null,null,null,"レフリー：",{"$f":"VLOOKUP(AD73,【進行】結果入力表!$B$7:$M$78,11,FALSE)","v":"WRC"},{"$f":"VLOOKUP(AD73,【進行】結果入力表!$B$7:$M$78,12,FALSE)","v":"山中"},null,null,null,null,null,null,"レフリー：",{"$f":"VLOOKUP(AM73,【進行】結果入力表!$B$7:$M$78,11,FALSE)","v":"WRC"},{"$f":"VLOOKUP(AM73,【進行】結果入力表!$B$7:$M$78,12,FALSE)","v":"末岡"},null,null,null,null,null,null,"レフリー：",{"$f":"VLOOKUP(AV73,【進行】結果入力表!$B$7:$M$78,11,FALSE)","v":"WRC"},{"$f":"VLOOKUP(AV73,【進行】結果入力表!$B$7:$M$78,12,FALSE)","v":"杉本"},null,null,null,null,null,null,"レフリー：",{"$f":"VLOOKUP(BE73,【進行】結果入力表!$B$7:$M$78,11,FALSE)","v":"WRC"},{"$f":"VLOOKUP(BE73,【進行】結果入力表!$B$7:$M$78,12,FALSE)","v":"大迫"},null,null,null,null,null,null,"レフリー：",{"$f":"VLOOKUP(BN73,【進行】結果入力表!$B$7:$M$78,11,FALSE)","v":"WRC"},{"$f":"VLOOKUP(BN73,【進行】結果入力表!$B$7:$M$78,12,FALSE)","v":""}]
[null,{"$f":"【結果】個人成績表!$A$1","v":"第16回　和奈滋対抗戦　　　(奈良；キングスポット)"},null,null,null,null,null,null,null,null,{"$f":"【結果】個人成績表!$A$1","v":"第16回　和奈滋対抗戦　　　(奈良；キングスポット)"},null,null,null,null,null,null,null,null,{"$f":"【結果】個人成績表!$A$1","v":"第16回　和奈滋対抗戦　　　(奈良；キングスポット)"},null,null,null,null,null,null,null,null,{"$f":"【結果】個人成績表!$A$1","v":"第16回　和奈滋対抗戦　　　(奈良；キングスポット)"},null,null,null,null,null,null,null,null,{"$f":"【結果】個人成績表!$A$1","v":"第16回　和奈滋対抗戦　　　(奈良；キングスポット)"},null,null,null,null,null,null,null,null,{"$f":"【結果】個人成績表!$A$1","v":"第16回　和奈滋対抗戦　　　(奈良；キングスポット)"},null,null,null,null,null,null,null,null,{"$f":"【結果】個人成績表!$A$1","v":"第16回　和奈滋対抗戦　　　(奈良；キングスポット)"},null,null,null,null,null,null,null,null,{"$f":"【結果】個人成績表!$A$1","v":"第16回　和奈滋対抗戦　　　(奈良；キングスポット)"},null,null,null,null,null,null," "]
[]
[null,"G-No",{"$f":"【進行】結果入力表!B63","v":50},null,null,"T-No",null,null,null,null,"G-No",{"$f":"【進行】結果入力表!B64","v":51},null,null,"T-No",null,null,null,null,"G-No",{"$f":"【進行】結果入力表!B65","v":52},null,null,"T-No",null,null,null,null,"G-No",{"$f":"【進行】結果入力表!B66","v":53},null,null,"T-No",null,null,null,null,"G-No",{"$f":"【進行】結果入力表!B67","v":54},null,null,"T-No",null,null,null,null,"G-No",{"$f":"【進行】結果入力表!B68","v":55},null,null,"T-No",null,null,null,null,"G-No",{"$f":"【進行】結果入力表!B69","v":56},null,null,"T-No",null,null,null,null,"G-No",{"$f":"【進行】結果入力表!B70","v":""},null,null,"T-No"]
[]
[null,{"$f":"VLOOKUP(C83,【進行】結果入力表!$B$7:$J$78,2,FALSE)","v":"NRC"},null,null,"所属",{"$f":"VLOOKUP(C83,【進行】結果入力表!$B$7:$J$78,9,FALSE)","v":"WRC"},null,null,null,null,{"$f":"VLOOKUP(L83,【進行】結果入力表!$B$7:$J$78,2,FALSE)","v":"NRC"},null,null,"所属",{"$f":"VLOOKUP(L83,【進行】結果入力表!$B$7:$J$78,9,FALSE)","v":"WRC"},null,null,null,null,{"$f":"VLOOKUP(U83,【進行】結果入力表!$B$7:$J$78,2,FALSE)","v":"NRC"},null,null,"所属",{"$f":"VLOOKUP(U83,【進行】結果入力表!$B$7:$J$78,9,FALSE)","v":"WRC"},null,null,null,null,{"$f":"VLOOKUP(AD83,【進行】結果入力表!$B$7:$J$78,2,FALSE)","v":"NRC"},null,null,"所属",{"$f":"VLOOKUP(AD83,【進行】結果入力表!$B$7:$J$78,9,FALSE)","v":"WRC"},null,null,null,null,{"$f":"VLOOKUP(AM83,【進行】結果入力表!$B$7:$J$78,2,FALSE)","v":"NRC"},null,null,"所属",{"$f":"VLOOKUP(AM83,【進行】結果入力表!$B$7:$J$78,9,FALSE)","v":"WRC"},null,null,null,null,{"$f":"VLOOKUP(AV83,【進行】結果入力表!$B$7:$J$78,2,FALSE)","v":"NRC"},null,null,"所属",{"$f":"VLOOKUP(AV83,【進行】結果入力表!$B$7:$J$78,9,FALSE)","v":"WRC"},null,null,null,null,{"$f":"VLOOKUP(BE83,【進行】結果入力表!$B$7:$J$78,2,FALSE)","v":"NRC"},null,null,"所属",{"$f":"VLOOKUP(BE83,【進行】結果入力表!$B$7:$J$78,9,FALSE)","v":"WRC"},null,null,null,null,{"$f":"VLOOKUP(BN83,【進行】結果入力表!$B$7:$J$78,2,FALSE)","v":"NRC"},null,null,"所属",{"$f":"VLOOKUP(BN83,【進行】結果入力表!$B$7:$J$78,9,FALSE)","v":"SBC"}]
[null,{"$f":"VLOOKUP(C83,【進行】結果入力表!$B$7:$J$78,3,FALSE)","v":"白戸"},null,null,"氏名",{"$f":"VLOOKUP(C83,【進行】結果入力表!$B$7:$J$78,8,FALSE)","v":"中本"},null,null,null,null,{"$f":"VLOOKUP(L83,【進行】結果入力表!$B$7:$J$78,3,FALSE)","v":"植田"},null,null,"氏名",{"$f":"VLOOKUP(L83,【進行】結果入力表!$B$7:$J$78,8,FALSE)","v":"松房"},null,null,null,null,{"$f":"VLOOKUP(U83,【進行】結果入力表!$B$7:$J$78,3,FALSE)","v":"岩本"},null,null,"氏名",{"$f":"VLOOKUP(U83,【進行】結果入力表!$B$7:$J$78,8,FALSE)","v":"和田"},null,null,null,null,{"$f":"VLOOKUP(AD83,【進行】結果入力表!$B$7:$J$78,3,FALSE)","v":"白戸"},null,null,"氏名",{"$f":"VLOOKUP(AD83,【進行】結果入力表!$B$7:$J$78,8,FALSE)","v":"山中"},null,null,null,null,{"$f":"VLOOKUP(AM83,【進行】結果入力表!$B$7:$J$78,3,FALSE)","v":"斉藤"},null,null,"氏名",{"$f":"VLOOKUP(AM83,【進行】結果入力表!$B$7:$J$78,8,FALSE)","v":"末岡"},null,null,null,null,{"$f":"VLOOKUP(AV83,【進行】結果入力表!$B$7:$J$78,3,FALSE)","v":"山田"},null,null,"氏名",{"$f":"VLOOKUP(AV83,【進行】結果入力表!$B$7:$J$78,8,FALSE)","v":"杉本"},null,null,null,null,{"$f":"VLOOKUP(BE83,【進行】結果入力表!$B$7:$J$78,3,FALSE)","v":"吉向"},null,null,"氏名",{"$f":"VLOOKUP(BE83,【進行】結果入力表!$B$7:$J$78,8,FALSE)","v":"大迫"},null,null,null,null,{"$f":"VLOOKUP(BN83,【進行】結果入力表!$B$7:$J$78,3,FALSE)","v":""},null,null,"氏名",{"$f":"VLOOKUP(BN83,【進行】結果入力表!$B$7:$J$78,8,FALSE)","v":""}]
[null,null,null,null,"得点",null,null,null,null,null,null,null,null,"得点",null,null,null,null,null,null,null,null,"得点",null,null,null,null,null,null,null,null,"得点",null,null,null,null,null,null,null,null,"得点",null,null,null,null,null,null,null,null,"得点",null,null,null,null,null,null,null,null,"得点",null,null,null,null,null,null,null,null,"得点"]
[null,null,null,null,"HR",null,null,null,null,null,null,null,null,"HR",null,null,null,null,null,null,null,null,"HR",null,null,null,null,null,null,null,null,"HR",null,null,null,null,null,null,null,null,"HR",null,null,null,null,null,null,null,null,"HR",null,null,null,null,null,null,null,null,"HR",null,null,null,null,null,null,null,null,"HR"]
[]
[null,null,null,null,"レフリー：",{"$f":"VLOOKUP(C83,【進行】結果入力表!$B$7:$M$78,11,FALSE)","v":"SBC"},{"$f":"VLOOKUP(C83,【進行】結果入力表!$B$7:$M$78,12,FALSE)","v":"大橋"},null,null,null,null,null,null,"レフリー：",{"$f":"VLOOKUP(L83,【進行】結果入力表!$B$7:$M$78,11,FALSE)","v":"SBC"},{"$f":"VLOOKUP(L83,【進行】結果入力表!$B$7:$M$78,12,FALSE)","v":"西峰"},null,null,null,null,null,null,"レフリー：",{"$f":"VLOOKUP(U83,【進行】結果入力表!$B$7:$M$78,11,FALSE)","v":"SBC"},{"$f":"VLOOKUP(U83,【進行】結果入力表!$B$7:$M$78,12,FALSE)","v":"林"},null,null,null,null,null,null,"レフリー：",{"$f":"VLOOKUP(AD83,【進行】結果入力表!$B$7:$M$78,11,FALSE)","v":"SBC"},{"$f":"VLOOKUP(AD83,【進行】結果入力表!$B$7:$M$78,12,FALSE)","v":"秋田"},null,null,null,null,null,null,"レフリー：",{"$f":"VLOOKUP(AM83,【進行】結果入力表!$B$7:$M$78,11,FALSE)","v":"SBC"},{"$f":"VLOOKUP(AM83,【進行】結果入力表!$B$7:$M$78,12,FALSE)","v":"山中"},null,null,null,null,null,null,"レフリー：",{"$f":"VLOOKUP(AV83,【進行】結果入力表!$B$7:$M$78,11,FALSE)","v":"SBC"},{"$f":"VLOOKUP(AV83,【進行】結果入力表!$B$7:$M$78,12,FALSE)","v":"柳川"},null,null,null,null,null,null,"レフリー：",{"$f":"VLOOKUP(BE83,【進行】結果入力表!$B$7:$M$78,11,FALSE)","v":"SBC"},{"$f":"VLOOKUP(BE83,【進行】結果入力表!$B$7:$M$78,12,FALSE)","v":"大橋"},null,null,null,null,null,null,"レフリー：",{"$f":"VLOOKUP(BN83,【進行】結果入力表!$B$7:$M$78,11,FALSE)","v":"WRC"},{"$f":"VLOOKUP(BN83,【進行】結果入力表!$B$7:$M$78,12,FALSE)","v":""}]
[null,{"$f":"【結果】個人成績表!$A$1","v":"第16回　和奈滋対抗戦　　　(奈良；キングスポット)"},null,null,null,null,null,null,null,null,{"$f":"【結果】個人成績表!$A$1","v":"第16回　和奈滋対抗戦　　　(奈良；キングスポット)"},null,null,null,null,null,null,null,null,{"$f":"【結果】個人成績表!$A$1","v":"第16回　和奈滋対抗戦　　　(奈良；キングスポット)"},null,null,null,null,null,null,null,null,{"$f":"【結果】個人成績表!$A$1","v":"第16回　和奈滋対抗戦　　　(奈良；キングスポット)"},null,null,null,null,null,null,null,null,{"$f":"【結果】個人成績表!$A$1","v":"第16回　和奈滋対抗戦　　　(奈良；キングスポット)"},null,null,null,null,null,null,null,null,{"$f":"【結果】個人成績表!$A$1","v":"第16回　和奈滋対抗戦　　　(奈良；キングスポット)"},null,null,null,null,null,null,null,null,{"$f":"【結果】個人成績表!$A$1","v":"第16回　和奈滋対抗戦　　　(奈良；キングスポット)"},null,null,null,null,null,null,null,null,{"$f":"【結果】個人成績表!$A$1","v":"第16回　和奈滋対抗戦　　　(奈良；キングスポット)"},null,null,null,null,null,null," "]
[]
[null,"G-No",{"$f":"【進行】結果入力表!B71","v":57},null,null,"T-No",null,null,null,null,"G-No",{"$f":"【進行】結果入力表!B72","v":58},null,null,"T-No",null,null,null,null,"G-No",{"$f":"【進行】結果入力表!B73","v":59},null,null,"T-No",null,null,null,null,"G-No",{"$f":"【進行】結果入力表!B74","v":60},null,null,"T-No",null,null,null,null,"G-No",{"$f":"【進行】結果入力表!B75","v":61},null,null,"T-No",null,null,null,null,"G-No",{"$f":"【進行】結果入力表!B76","v":62},null,null,"T-No",null,null,null,null,"G-No",{"$f":"【進行】結果入力表!B77","v":63},null,null,"T-No",null,null,null,null,"G-No",{"$f":"【進行】結果入力表!B78","v":""},null,null,"T-No"]
[]
[null,{"$f":"VLOOKUP(C93,【進行】結果入力表!$B$7:$J$78,2,FALSE)","v":"WRC"},null,null,"所属",{"$f":"VLOOKUP(C93,【進行】結果入力表!$B$7:$J$78,9,FALSE)","v":"SBC"},null,null,null,null,{"$f":"VLOOKUP(L93,【進行】結果入力表!$B$7:$J$78,2,FALSE)","v":"WRC"},null,null,"所属",{"$f":"VLOOKUP(L93,【進行】結果入力表!$B$7:$J$78,9,FALSE)","v":"SBC"},null,null,null,null,{"$f":"VLOOKUP(U93,【進行】結果入力表!$B$7:$J$78,2,FALSE)","v":"WRC"},null,null,"所属",{"$f":"VLOOKUP(U93,【進行】結果入力表!$B$7:$J$78,9,FALSE)","v":"SBC"},null,null,null,null,{"$f":"VLOOKUP(AD93,【進行】結果入力表!$B$7:$J$78,2,FALSE)","v":"WRC"},null,null,"所属",{"$f":"VLOOKUP(AD93,【進行】結果入力表!$B$7:$J$78,9,FALSE)","v":"SBC"},null,null,null,null,{"$f":"VLOOKUP(AM93,【進行】結果入力表!$B$7:$J$78,2,FALSE)","v":"WRC"},null,null,"所属",{"$f":"VLOOKUP(AM93,【進行】結果入力表!$B$7:$J$78,9,FALSE)","v":"SBC"},null,null,null,null,{"$f":"VLOOKUP(AV93,【進行】結果入力表!$B$7:$J$78,2,FALSE)","v":"WRC"},null,null,"所属",{"$f":"VLOOKUP(AV93,【進行】結果入力表!$B$7:$J$78,9,FALSE)","v":"SBC"},null,null,null,null,{"$f":"VLOOKUP(BE93,【進行】結果入力表!$B$7:$J$78,2,FALSE)","v":"WRC"},null,null,"所属",{"$f":"VLOOKUP(BE93,【進行】結果入力表!$B$7:$J$78,9,FALSE)","v":"SBC"},null,null,null,null,{"$f":"VLOOKUP(BN93,【進行】結果入力表!$B$7:$J$78,2,FALSE)","v":"NRC"},null,null,"所属",{"$f":"VLOOKUP(BN93,【進行】結果入力表!$B$7:$J$78,9,FALSE)","v":"SBC"}]
[null,{"$f":"VLOOKUP(C93,【進行】結果入力表!$B$7:$J$78,3,FALSE)","v":"中本"},null,null,"氏名",{"$f":"VLOOKUP(C93,【進行】結果入力表!$B$7:$J$78,8,FALSE)","v":"大橋"},null,null,null,null,{"$f":"VLOOKUP(L93,【進行】結果入力表!$B$7:$J$78,3,FALSE)","v":"松房"},null,null,"氏名",{"$f":"VLOOKUP(L93,【進行】結果入力表!$B$7:$J$78,8,FALSE)","v":"西峰"},null,null,null,null,{"$f":"VLOOKUP(U93,【進行】結果入力表!$B$7:$J$78,3,FALSE)","v":"和田"},null,null,"氏名",{"$f":"VLOOKUP(U93,【進行】結果入力表!$B$7:$J$78,8,FALSE)","v":"林"},null,null,null,null,{"$f":"VLOOKUP(AD93,【進行】結果入力表!$B$7:$J$78,3,FALSE)","v":"山中"},null,null,"氏名",{"$f":"VLOOKUP(AD93,【進行】結果入力表!$B$7:$J$78,8,FALSE)","v":"秋田"},null,null,null,null,{"$f":"VLOOKUP(AM93,【進行】結果入力表!$B$7:$J$78,3,FALSE)","v":"末岡"},null,null,"氏名",{"$f":"VLOOKUP(AM93,【進行】結果入力表!$B$7:$J$78,8,FALSE)","v":"山中"},null,null,null,null,{"$f":"VLOOKUP(AV93,【進行】結果入力表!$B$7:$J$78,3,FALSE)","v":"杉本"},null,null,"氏名",{"$f":"VLOOKUP(AV93,【進行】結果入力表!$B$7:$J$78,8,FALSE)","v":"柳川"},null,null,null,null,{"$f":"VLOOKUP(BE93,【進行】結果入力表!$B$7:$J$78,3,FALSE)","v":"大迫"},null,null,"氏名",{"$f":"VLOOKUP(BE93,【進行】結果入力表!$B$7:$J$78,8,FALSE)","v":"大橋"},null,null,null,null,{"$f":"VLOOKUP(BN93,【進行】結果入力表!$B$7:$J$78,3,FALSE)","v":""},null,null,"氏名",{"$f":"VLOOKUP(BN93,【進行】結果入力表!$B$7:$J$78,8,FALSE)","v":""}]
[null,null,null,null,"得点",null,null,null,null,null,null,null,null,"得点",null,null,null,null,null,null,null,null,"得点",null,null,null,null,null,null,null,null,"得点",null,null,null,null,null,null,null,null,"得点",null,null,null,null,null,null,null,null,"得点",null,null,null,null,null,null,null,null,"得点",null,null,null,null,null,null,null,null,"得点"]
[null,null,null,null,"HR",null,null,null,null,null,null,null,null,"HR",null,null,null,null,null,null,null,null,"HR",null,null,null,null,null,null,null,null,"HR",null,null,null,null,null,null,null,null,"HR",null,null,null,null,null,null,null,null,"HR",null,null,null,null,null,null,null,null,"HR",null,null,null,null,null,null,null,null,"HR"]
[]
[null,null,null,null,"レフリー：",{"$f":"VLOOKUP(C93,【進行】結果入力表!$B$7:$M$78,11,FALSE)","v":"NRC"},{"$f":"VLOOKUP(C93,【進行】結果入力表!$B$7:$M$78,12,FALSE)","v":"白戸"},null,null,null,null,null,null,"レフリー：",{"$f":"VLOOKUP(L93,【進行】結果入力表!$B$7:$M$78,11,FALSE)","v":"NRC"},{"$f":"VLOOKUP(L93,【進行】結果入力表!$B$7:$M$78,12,FALSE)","v":"植田"},null,null,null,null,null,null,"レフリー：",{"$f":"VLOOKUP(U93,【進行】結果入力表!$B$7:$M$78,11,FALSE)","v":"NRC"},{"$f":"VLOOKUP(U93,【進行】結果入力表!$B$7:$M$78,12,FALSE)","v":"岩本"},null,null,null,null,null,null,"レフリー：",{"$f":"VLOOKUP(AD93,【進行】結果入力表!$B$7:$M$78,11,FALSE)","v":"NRC"},{"$f":"VLOOKUP(AD93,【進行】結果入力表!$B$7:$M$78,12,FALSE)","v":"白戸"},null,null,null,null,null,null,"レフリー：",{"$f":"VLOOKUP(AM93,【進行】結果入力表!$B$7:$M$78,11,FALSE)","v":"NRC"},{"$f":"VLOOKUP(AM93,【進行】結果入力表!$B$7:$M$78,12,FALSE)","v":"斉藤"},null,null,null,null,null,null,"レフリー：",{"$f":"VLOOKUP(AV93,【進行】結果入力表!$B$7:$M$78,11,FALSE)","v":"NRC"},{"$f":"VLOOKUP(AV93,【進行】結果入力表!$B$7:$M$78,12,FALSE)","v":"山田"},null,null,null,null,null,null,"レフリー：",{"$f":"VLOOKUP(BE93,【進行】結果入力表!$B$7:$M$78,11,FALSE)","v":"NRC"},{"$f":"VLOOKUP(BE93,【進行】結果入力表!$B$7:$M$78,12,FALSE)","v":"吉向"},null,null,null,null,null,null,"レフリー：",{"$f":"VLOOKUP(BN93,【進行】結果入力表!$B$7:$M$78,11,FALSE)","v":"WRC"},{"$f":"VLOOKUP(BN93,【進行】結果入力表!$B$7:$M$78,12,FALSE)","v":""}]
[]
[]
[]
[]
[null,null,null,null,null,"io"]

{"sheet":"【進行】結果入力表","index":2,"n_rows":78,"n_cols":13,"rows_kept":78,"cut":false,"hidden":false,"merged":[]}
[]
[]
[]
[]
[]
["節","G-No","所属A","選手名A","HR","得点","得点","HR","選手名B","所属B",null,"レフリー"]
["第1節",1,{"$f":"IF(【準備】登録!B11=\"\",\"\",【準備】登録!B11)","v":"NRC"},{"$f":"IF(【準備】登録!$D$11=\"\",\"\",【準備】登録!$D$11)","v":"斉藤"},null,62,"w",null,{"$f":"IF(【準備】登録!$D$13=\"\",\"\",【準備】登録!$D$13)","v":"大橋"},{"$f":"IF(【準備】登録!B13=\"\",\"\",【準備】登録!B13)","v":"SBC"},null,{"$f":"J15","v":"WRC"},{"$f":"I15","v":"和田"}]
[null,2,{"$f":"$C$7","v":"NRC"},{"$f":"IF(【準備】登録!$G$11=\"\",\"\",【準備】登録!$G$11)","v":"山田"},null,"w",83,null,{"$f":"IF(【準備】登録!$G$13=\"\",\"\",【準備】登録!$G$13)","v":"西峰"},{"$f":"$J$7","v":"SBC"},null,{"$f":"J16","v":"WRC"},{"$f":"I16","v":"山中"}]
[null,3,{"$f":"$C$7","v":"NRC"},{"$f":"IF(【準備】登録!$J$11=\"\",\"\",【準備】登録!$J$11)","v":"吉向"},null,"w",157,null,{"$f":"IF(【準備】登録!$J$13=\"\",\"\",【準備】登録!$J$13)","v":"林"},{"$f":"$J$7","v":"SBC"},null,"WRC","末岡"]
[null,4,"NRC",{"$f":"IF(【準備】登録!$M$11=\"\",\"\",【準備】登録!$M$11)","v":"白戸"},null,"w",118,null,{"$f":"IF(【準備】登録!$M$13=\"\",\"\",【準備】登録!$M$13)","v":"秋田"},"SBC",null,"WRC","杉本"]
[null,5,"NRC",{"$f":"IF(【準備】登録!$P$11=\"\",\"\",【準備】登録!$P$11)","v":"植田"},null,"w",141,null,{"$f":"IF(【準備】登録!$P$13=\"\",\"\",【準備】登録!$P$13)","v":"山中"},"SBC",null,"WRC","大迫"]
[null,6,"NRC",{"$f":"IF(【準備】登録!$S$11=\"\",\"\",【準備】登録!$S$11)","v":"岩本"},null,"w",164,null,{"$f":"IF(【準備】登録!$S$13=\"\",\"\",【準備】登録!$S$13)","v":"柳川"},"SBC",null,"WRC","中本"]
[null,7,"NRC",{"$f":"IF(【準備】登録!$V$11=\"\",\"\",【準備】登録!$V$11)","v":"白戸"},null,"w",53,null,{"$f":"IF(【準備】登録!$V$13=\"\",\"\",【準備】登録!$V$13)","v":"大橋"},"SBC",null,"WRC","松房"]
[null,{"$f":"IF(D14=\"\",\"\",8)","v":""},"NRC",{"$f":"IF(【準備】登録!$Y$11=\"\",\"\",【準備】登録!Y11)","v":""},null,null,null,null,{"$f":"IF(【準備】登録!$Y$13=\"\",\"\",【準備】登録!Y13)","v":""},"SBC",null,"WRC",""]
[null,{"$f":"IF(D14=\"\",8,9)","v":8},"NRC",{"$f":"D7","v":"斉藤"},null,5,"w",111,{"$f":"IF(【準備】登録!$D$12=\"\",\"\",【準備】登録!$D$12)","v":"和田"},{"$f":"$C$23","v":"WRC"},null,{"$f":"J7","v":"SBC"},{"$f":"I7","v":"大橋"}]
[null,{"$f":"B15+1","v":9},"NRC",{"$f":"D8","v":"山田"},null,"w",134,null,{"$f":"IF(【準備】登録!$G$12=\"\",\"\",【準備】登録!$G$12)","v":"山中"},"WRC",null,{"$f":"J8","v":"SBC"},{"$f":"I8","v":"西峰"}]
[null,10,"NRC","吉向",120,"w",164,null,{"$f":"IF(【準備】登録!$J$12=\"\",\"\",【準備】登録!$J$12)","v":"末岡"},"WRC",null,"SBC","林"]
[null,11,"NRC","白戸",null,57,"w",null,{"$f":"IF(【準備】登録!$M$12=\"\",\"\",【準備】登録!$M$12)","v":"杉本"},"WRC",null,"SBC","秋田"]
[null,12,"NRC","植田",null,"w",21,null,{"$f":"IF(【準備】登録!$P$12=\"\",\"\",【準備】登録!$P$12)","v":"大迫"},"WRC",null,"SBC","山中"]
[null,13,"NRC","岩本",null,"w",113,null,{"$f":"IF(【準備】登録!$S$12=\"\",\"\",【準備】登録!$S$12)","v":"中本"},"WRC",null,"SBC","柳川"]
[null,14,"NRC","白戸",null,"w",99,null,{"$f":"IF(【準備】登録!$V$12=\"\",\"\",【準備】登録!$V$12)","v":"松房"},"WRC",null,"SBC","大橋"]
[null,{"$f":"IF(D22=\"\",\"\",B21+1)","v":""},"NRC","",null,null,null,null,{"$f":"IF(【準備】登録!$Y$12=\"\",\"\",【準備】登録!Y12)","v":""},"WRC",null,"SBC",""]
[null,{"$f":"IF(D22=\"\",B21+1,B22+1)","v":15},{"$f":"IF(【準備】登録!B12=\"\",\"\",【準備】登録!B12)","v":"WRC"},{"$f":"I15","v":"和田"},null,"w",81,null,{"$f":"I7","v":"大橋"},{"$f":"$J$7","v":"SBC"},null,{"$f":"C7","v":"NRC"},{"$f":"D15","v":"斉藤"}]
[null,{"$f":"B23+1","v":16},{"$f":"$C$23","v":"WRC"},{"$f":"I16","v":"山中"},null,159,"w",null,{"$f":"I8","v":"西峰"},"SBC",null,{"$f":"C8","v":"NRC"},{"$f":"D16","v":"山田"}]
[null,17,{"$f":"$C$23","v":"WRC"},"末岡",135,"w",78,null,"林","SBC",null,"NRC","吉向"]
[null,18,"WRC","杉本",null,"w",73,null,"秋田","SBC",null,"NRC","白戸"]
[null,19,"WRC","大迫",null,74,"w",null,"山中","SBC",null,"NRC","植田"]
[null,20,"WRC","中本",null,"w",120,null,"柳川","SBC",null,"NRC","岩本"]
[null,21,"WRC","松房",null,"w",49,null,"大橋","SBC",null,"NRC","白戸"]
[null,{"$f":"IF(D30=\"\",\"\",B29+1)","v":""},"WRC","",null,null,null,null,"","SBC",null,"NRC",""]
["第2節",{"$f":"IF(D30=\"\",B29+1,B30+1)","v":22},{"$f":"$C$7","v":"NRC"},{"$f":"D39","v":"岩本"},null,48,"w",null,{"$f":"IF(【準備】登録!$D$13=\"\",\"\",【準備】登録!$D$13)","v":"大橋"},{"$f":"$J$7","v":"SBC"},null,{"$f":"J39","v":"WRC"},{"$f":"I39","v":"松房"}]
[null,{"$f":"B31+1","v":23},"NRC","白戸",null,96,"w",null,{"$f":"IF(【準備】登録!$G$13=\"\",\"\",【準備】登録!$G$13)","v":"西峰"},"SBC",null,{"$f":"J40","v":"WRC"},{"$f":"I40","v":"和田"}]
[null,24,"NRC","斉藤",null,107,"w",null,{"$f":"IF(【準備】登録!$J$13=\"\",\"\",【準備】登録!$J$13)","v":"林"},"SBC",null,"WRC","山中"]
[null,25,"NRC","山田",null,"w",137,null,{"$f":"IF(【準備】登録!$M$13=\"\",\"\",【準備】登録!$M$13)","v":"秋田"},"SBC",null,"WRC","末岡"]
[null,26,"NRC","吉向",null,"w",169,null,{"$f":"IF(【準備】登録!$P$13=\"\",\"\",【準備】登録!$P$13)","v":"山中"},"SBC",null,"WRC","杉本"]
[null,27,"NRC","白戸",null,"w",57,null,{"$f":"IF(【準備】登録!$S$13=\"\",\"\",【準備】登録!$S$13)","v":"柳川"},"SBC",null,"WRC","大迫"]
[null,28,"NRC","植田",null,"w",102,null,{"$f":"IF(【準備】登録!$V$13=\"\",\"\",【準備】登録!$V$13)","v":"大橋"},"SBC",null,"WRC","中本"]
[null,{"$f":"IF(D46=\"\",\"\",B37+1)","v":""},"NRC","",null,null,null,null,{"$f":"IF(【準備】登録!Y13=\"\",\"\",【準備】登録!$Y$13)","v":""},"SBC",null,"WRC",""]
[null,{"$f":"IF(D46=\"\",B37+1,B38+1)","v":29},"NRC",{"$f":"IF($D$7=\"\",\"\",IF(【準備】登録!Y11=\"\",【準備】登録!S11,【準備】登録!$V$11))","v":"岩本"},null,132,"w",null,{"$f":"IF($D$7=\"\",\"\",IF(【準備】登録!Y12=\"\",【準備】登録!V12,【準備】登録!$Y$12))","v":"松房"},{"$f":"$C$23","v":"WRC"},null,{"$f":"J31","v":"SBC"},{"$f":"I31","v":"大橋"}]
[null,{"$f":"B39+1","v":30},"NRC",{"$f":"IF($D$7=\"\",\"\",IF(【準備】登録!$Y$11=\"\",【準備】登録!V11,【準備】登録!Y11))","v":"白戸"},null,120,"w",null,{"$f":"IF($D$7=\"\",\"\",【準備】登録!$D$12)","v":"和田"},"WRC",null,{"$f":"J32","v":"SBC"},{"$f":"I32","v":"西峰"}]
[null,31,"NRC",{"$f":"IF($D$7=\"\",\"\",【準備】登録!$D$11)","v":"斉藤"},null,"w",15,null,{"$f":"IF($D$7=\"\",\"\",【準備】登録!$G$12)","v":"山中"},"WRC",null,"SBC","林"]
[null,32,"NRC",{"$f":"IF($D$7=\"\",\"\",【準備】登録!$G$11)","v":"山田"},110,"w",145,null,{"$f":"IF($D$7=\"\",\"\",【準備】登録!$J$12)","v":"末岡"},"WRC",null,"SBC","秋田"]
[null,33,"NRC",{"$f":"IF($D$7=\"\",\"\",【準備】登録!$J$11)","v":"吉向"},null,"w",164,null,{"$f":"IF($D$7=\"\",\"\",【準備】登録!$M$12)","v":"杉本"},"WRC",null,"SBC","山中"]
[null,34,"NRC",{"$f":"IF($D$7=\"\",\"\",【準備】登録!$M$11)","v":"白戸"},null,"w",48,null,{"$f":"IF($D$7=\"\",\"\",【準備】登録!$P$12)","v":"大迫"},"WRC",null,"SBC","柳川"]
[null,35,"NRC",{"$f":"IF($D$7=\"\",\"\",【準備】登録!$P$11)","v":"植田"},null,"w",141,null,{"$f":"IF($D$7=\"\",\"\",【準備】登録!$S$12)","v":"中本"},"WRC",null,"SBC","大橋"]
[null,{"$f":"IF(D38=\"\",\"\",B45+1)","v":""},"NRC",{"$f":"IF(【準備】登録!Y11=\"\",\"\",【準備】登録!$S$11)","v":""},null,null,null,null,{"$f":"IF(【準備】登録!Y12=\"\",\"\",【準備】登録!$V$12)","v":""},"WRC",null,"SBC",""]
[null,{"$f":"IF(D38=\"\",B45+1,B46+1)","v":36},{"$f":"$C$23","v":"WRC"},{"$f":"I39","v":"松房"},null,"w",22,null,{"$f":"I31","v":"大橋"},"SBC",null,{"$f":"C39","v":"NRC"},{"$f":"D39","v":"岩本"}]
[null,{"$f":"B47+1","v":37},"WRC",{"$f":"I40","v":"和田"},null,98,"w",null,"西峰","SBC",null,{"$f":"C40","v":"NRC"},{"$f":"D40","v":"白戸"}]
[null,38,"WRC","山中",null,"w",104,null,"林","SBC",null,"NRC","斉藤"]
[null,39,"WRC","末岡",null,"w",151,null,"秋田","SBC",null,"NRC","山田"]
[null,40,"WRC","杉本",null,"w",75,null,"山中","SBC",null,"NRC","吉向"]
[null,41,"WRC","大迫",null,142,"w",null,"柳川","SBC",null,"NRC","白戸"]
[null,42,"WRC","中本",null,156,"w",null,"大橋","SBC",null,"NRC","植田"]
[null,{"$f":"IF(D54=\"\",\"\",B53+1)","v":""},"WRC","",null,null,null,null,"","SBC",null,"NRC",""]
["第3節",{"$f":"IF(D54=\"\",B53+1,B54+1)","v":43},{"$f":"$C$7","v":"NRC"},{"$f":"D63","v":"白戸"},null,"w",15,null,{"$f":"IF($D$7=\"\",\"\",【準備】登録!$D$13)","v":"大橋"},{"$f":"$J$7","v":"SBC"},null,{"$f":"J63","v":"WRC"},{"$f":"I63","v":"中本"}]
[null,{"$f":"B55+1","v":44},"NRC","植田",null,"w",72,null,{"$f":"IF($D$7=\"\",\"\",【準備】登録!$G$13)","v":"西峰"},"SBC",null,{"$f":"J64","v":"WRC"},{"$f":"I64","v":"松房"}]
[null,45,"NRC","岩本",null,147,"w",null,{"$f":"IF($D$7=\"\",\"\",【準備】登録!$J$13)","v":"林"},"SBC",null,"WRC","和田"]
[null,46,"NRC","白戸",null,"w",155,null,{"$f":"IF($D$7=\"\",\"\",【準備】登録!$M$13)","v":"秋田"},"SBC",null,"WRC","山中"]
[null,47,"NRC","斉藤",null,87,"w",null,{"$f":"IF($D$7=\"\",\"\",【準備】登録!$P$13)","v":"山中"},"SBC",null,"WRC","末岡"]
[null,48,"NRC","山田",null,"w",62,null,{"$f":"IF($D$7=\"\",\"\",【準備】登録!$S$13)","v":"柳川"},"SBC",null,"WRC","杉本"]
[null,49,"NRC","吉向",null,"w",52,null,{"$f":"IF($D$7=\"\",\"\",【準備】登録!$V$13)","v":"大橋"},"SBC",null,"WRC","大迫"]
[null,{"$f":"IF(D70=\"\",\"\",B61+1)","v":""},"NRC","",null,null,null,null,{"$f":"IF(【準備】登録!Y13=\"\",\"\",【準備】登録!$Y$13)","v":""},"SBC",null,"WRC",""]
[null,{"$f":"IF(D70=\"\",B61+1,B62+1)","v":50},"NRC",{"$f":"IF($D$7=\"\",\"\",IF(【準備】登録!Y11=\"\",【準備】登録!M11,【準備】登録!$P$11))","v":"白戸"},null,117,"w",null,{"$f":"IF($D$7=\"\",\"\",IF(【準備】登録!Y12=\"\",【準備】登録!S12,【準備】登録!$V$12))","v":"中本"},{"$f":"$C$23","v":"WRC"},null,{"$f":"J55","v":"SBC"},{"$f":"I55","v":"大橋"}]
[null,{"$f":"B63+1","v":51},"NRC",{"$f":"IF($D$7=\"\",\"\",IF(【準備】登録!Y11=\"\",【準備】登録!P11,【準備】登録!$S$11))","v":"植田"},null,84,"w",null,{"$f":"IF($D$7=\"\",\"\",IF(【準備】登録!Y12=\"\",【準備】登録!V12,【準備】登録!$Y$12))","v":"松房"},"WRC",null,{"$f":"J56","v":"SBC"},{"$f":"I56","v":"西峰"}]
[null,52,"NRC",{"$f":"IF($D$7=\"\",\"\",IF(【準備】登録!Y11=\"\",【準備】登録!S11,【準備】登録!$V$11))","v":"岩本"},100,148,"w",104,{"$f":"IF($D$7=\"\",\"\",【準備】登録!$D$12)","v":"和田"},"WRC",null,"SBC","林"]
[null,53,"NRC",{"$f":"IF($D$7=\"\",\"\",IF(【準備】登録!Y11=\"\",【準備】登録!V11,【準備】登録!$Y$11))","v":"白戸"},null,138,"w",null,{"$f":"IF($D$7=\"\",\"\",【準備】登録!$G$12)","v":"山中"},"WRC",null,"SBC","秋田"]
[null,54,"NRC",{"$f":"IF($D$7=\"\",\"\",【準備】登録!$D$11)","v":"斉藤"},null,"w",92,null,{"$f":"IF($D$7=\"\",\"\",【準備】登録!$J$12)","v":"末岡"},"WRC",null,"SBC","山中"]
[null,55,"NRC",{"$f":"IF($D$7=\"\",\"\",【準備】登録!$G$11)","v":"山田"},null,141,"w",null,{"$f":"IF($D$7=\"\",\"\",【準備】登録!$M$12)","v":"杉本"},"WRC",null,"SBC","柳川"]
[null,56,"NRC",{"$f":"IF($D$7=\"\",\"\",【準備】登録!$J$11)","v":"吉向"},104,"w",165,null,{"$f":"IF($D$7=\"\",\"\",【準備】登録!$P$12)","v":"大迫"},"WRC",null,"SBC","大橋"]
[null,{"$f":"IF(D62=\"\",\"\",B69+1)","v":""},"NRC",{"$f":"IF(【準備】登録!Y11=\"\",\"\",【準備】登録!$M$11)","v":""},null,null,null,null,{"$f":"IF(【準備】登録!Y12=\"\",\"\",【準備】登録!$S$12)","v":""},"WRC",null,"SBC",""]
[null,{"$f":"IF(D62=\"\",B69+1,B70+1)","v":57},{"$f":"$C$23","v":"WRC"},{"$f":"I63","v":"中本"},null,131,"w",null,{"$f":"I55","v":"大橋"},"SBC",null,{"$f":"C63","v":"NRC"},{"$f":"D63","v":"白戸"}]
[null,{"$f":"B71+1","v":58},"WRC",{"$f":"I64","v":"松房"},null,"w",150,null,"西峰","SBC",null,{"$f":"C64","v":"NRC"},{"$f":"D64","v":"植田"}]
[null,59,"WRC","和田",null,92,"w",113,"林","SBC",null,"NRC","岩本"]
[null,60,"WRC","山中",null,131,"w",null,"秋田","SBC",null,"NRC","白戸"]
[null,61,"WRC","末岡",null,"w",158,105,"山中","SBC",null,"NRC","斉藤"]
[null,62,"WRC","杉本",null,"w",95,null,"柳川","SBC",null,"NRC","山田"]
[null,63,"WRC","大迫",null,52,"w",null,"大橋","SBC",null,"NRC","吉向"]
[null,{"$f":"IF(D78=\"\",\"\",B77+1)","v":""},"WRC","",null,null,null,null,"","SBC",null,"NRC",""]

{"sheet":"【結果】個人成績表","index":3,"n_rows":35,"n_cols":89,"rows_kept":35,"cut":false,"hidden":false,"merged":[[1,64,1,69],[33,49,33,50],[33,29,33,30],[33,53,33,54],[33,59,33,60],[33,43,33,44],[31,43,31,44],[31,59,31,60],[31,53,31,54],[33,33,33,34],[33,39,33,40],[32,49,32,50],[32,29,32,30],[32,43,32,44],[32,31,32,32],[33,31,33,32],[32,41,32,42],[33,41,33,42],[30,59,30,60],[30,53,30,54],[30,49,30,50],[30,51,30,52],[30,41,30,42],[27,29,27,30],[33,1,33,3],[33,5,33,6],[33,19,33,20],[33,13,33,14],[33,9,33,10],[33,11,33,12],[32,59,32,60],[32,53,32,54],[32,9,32,10],[32,23,32,24],[32,39,32,40],[32,33,32,34],[32,21,32,22],[32,1,32,3],[32,5,32,6],[32,19,32,20],[32,13,32,14],[32,11,32,12],[33,21,33,22],[33,23,33,24],[33,51,33,52],[31,9,31,10],[31,11,31,12],[31,1,31,3],[31,5,31,6],[31,29,31,30],[31,31,31,32],[31,19,31,20],[31,13,31,14],[30,29,30,30],[30,31,30,32],[31,21,31,22],[31,23,31,24],[30,1,30,3],[30,5,30,6],[30,19,30,20],[30,13,30,14],[30,9,30,10],[30,11,30,12],[29,29,29,30],[29,31,29,32],[30,21,30,22],[30,23,30,24],[29,21,29,22],[29,1,29,3],[29,5,29,6],[29,19,29,20],[29,13,29,14],[29,9,29,10],[29,11,29,12],[28,1,28,3],[28,5,28,6],[28,19,28,20],[28,13,28,14],[28,9,28,10],[28,11,28,12],[29,59,29,60],[29,53,29,54],[29,49,29,50],[29,51,29,52],[28,59,28,60],[28,21,28,22],[28,23,28,24],[28,39,28,40],[28,33,28,34],[28,29,28,30],[28,31,28,32],[28,41,28,42],[29,41,29,42],[28,53,28,54],[28,49,28,50],[28,51,28,52],[29,23,29,24],[29,39,29,40],[27,1,27,3],[27,5,27,6],[27,19,27,20],[27,13,27,14],[27,9,27,10],[27,23,27,24],[27,21,27,22],[27,59,27,60],[27,53,27,54],[27,49,27,50],[27,51,27,52],[27,11,27,12],[27,41,27,42],[26,5,26,6],[26,9,26,10],[26,11,26,12],[25,41,25,42],[26,21,26,22],[26,19,26,20],[26,13,26,14],[26,31,26,32],[26,41,26,42],[26,53,26,54],[26,49,26,50],[25,59,25,60],[25,53,25,54],[25,49,25,50],[26,23,26,24],[26,39,26,40],[26,33,26,34],[26,29,26,30],[26,43,26,44],[26,59,26,60],[26,51,26,52],[24,5,24,6],[24,19,24,20],[24,13,24,14],[24,9,24,10],[24,11,24,12],[25,23,25,24],[24,29,24,30],[25,39,25,40],[24,23,24,24],[24,33,24,34],[25,29,25,30],[25,33,25,34],[24,21,24,22],[25,21,25,22],[25,5,25,6],[25,19,25,20],[25,13,25,14],[25,9,25,10],[22,59,22,60],[22,53,22,54],[24,31,24,32],[22,41,22,42],[22,43,22,44],[23,33,23,34],[23,39,23,40],[22,31,22,32],[22,39,22,40],[22,33,22,34],[24,41,24,42],[22,49,22,50],[24,59,24,60],[24,53,24,54],[24,49,24,50],[24,43,24,44],[23,5,23,6],[23,59,23,60],[23,43,23,44],[23,49,23,50],[23,41,23,42],[23,53,23,54],[23,9,23,10],[23,23,23,24],[23,29,23,30],[23,11,23,12],[22,23,22,24],[22,29,22,30],[22,1,22,3],[22,5,22,6],[22,19,22,20],[22,13,22,14],[22,9,22,10],[22,11,22,12],[22,21,22,22],[20,59,20,60],[20,53,20,54],[21,59,21,60],[21,53,21,54],[21,49,21,50],[21,51,21,52],[20,49,20,50],[20,51,20,52],[20,5,20,6],[20,19,20,20],[20,13,20,14],[20,9,20,10],[20,11,20,12],[21,43,21,44],[21,41,21,42],[21,23,21,24],[21,39,21,40],[21,33,21,34],[21,29,21,30],[21,5,21,6],[21,19,21,20],[21,13,21,14],[21,9,21,10],[21,11,21,12],[19,23,19,24],[19,39,19,40],[19,33,19,34],[19,59,19,60],[19,53,19,54],[19,49,19,50],[19,51,19,52],[19,5,19,6],[19,19,19,20],[19,13,19,14],[19,9,19,10],[19,11,19,12],[21,31,21,32],[18,59,18,60],[18,53,18,54],[18,23,18,24],[18,21,18,22],[18,33,18,34],[18,29,18,30],[18,31,18,32],[18,43,18,44],[18,41,18,42],[18,39,18,40],[18,49,18,50],[20,21,20,22],[20,41,20,42],[20,43,20,44],[19,29,19,30],[19,31,19,32],[20,23,20,24],[20,39,20,40],[20,33,20,34],[20,29,20,30],[20,31,20,32],[19,43,19,44],[19,41,19,42],[17,5,17,6],[17,19,17,20],[17,13,17,14],[17,9,17,10],[17,11,17,12],[17,23,17,24],[18,51,18,52],[18,5,18,6],[18,19,18,20],[18,13,18,14],[18,9,18,10],[18,11,18,12],[16,5,16,6],[16,19,16,20],[16,13,16,14],[16,9,16,10],[16,11,16,12],[16,59,16,60],[16,53,16,54],[16,49,16,50],[16,51,16,52],[16,23,16,24],[16,39,16,40],[16,33,16,34],[16,29,16,30],[16,31,16,32],[16,43,16,44],[15,33,15,34],[15,29,15,30],[15,31,15,32],[15,43,15,44],[15,41,15,42],[15,39,15,40],[17,59,17,60],[17,53,17,54],[17,49,17,50],[17,51,17,52],[17,43,17,44],[17,29,17,30],[17,31,17,32],[17,39,17,40],[17,33,17,34],[14,31,14,32],[14,59,14,60],[14,53,14,54],[14,49,14,50],[14,43,14,44],[15,1,15,3],[15,5,15,6],[15,19,15,20],[15,13,15,14],[15,9,15,10],[15,23,15,24],[15,11,15,12],[14,5,14,6],[14,19,14,20],[14,13,14,14],[14,9,14,10],[14,23,14,24],[14,29,14,30],[14,11,14,12],[14,39,14,40],[15,59,15,60],[15,53,15,54],[15,49,15,50],[15,51,15,52],[9,43,9,44],[9,53,9,54],[10,59,10,60],[13,33,13,34],[13,43,13,44],[13,41,13,42],[14,41,14,42],[12,59,12,60],[11,43,11,44],[14,33,14,34],[12,49,12,50],[13,53,13,54],[13,59,13,60],[12,53,12,54],[11,33,11,34],[11,29,11,30],[11,31,11,32],[11,39,11,40],[12,31,12,32],[12,33,12,34],[5,53,5,54],[6,53,6,54],[4,59,4,60],[7,53,7,54],[6,43,6,44],[4,23,4,24],[4,29,4,30],[4,33,4,34],[4,39,4,40],[4,31,4,32],[4,53,4,54],[4,51,4,52],[4,49,4,50],[4,43,4,44],[5,49,5,50],[6,59,6,60],[4,41,4,42],[6,39,6,40],[6,33,6,34],[5,59,5,60],[5,43,5,44],[5,51,5,52],[6,51,6,52],[5,39,5,40],[5,29,5,30],[12,39,12,40],[12,29,12,30],[7,39,7,40],[7,33,7,34],[10,39,10,40],[9,31,9,32],[10,31,10,32],[13,39,13,40],[13,31,13,32],[6,29,6,30],[10,33,10,34],[9,39,9,40],[10,29,10,30],[4,19,4,20],[5,13,5,14],[6,13,6,14],[5,19,5,20],[6,19,6,20],[11,5,11,6],[6,5,6,6],[7,5,7,6],[4,5,4,6],[5,5,5,6],[10,19,10,20],[8,19,8,20],[9,19,9,20],[9,9,9,10],[10,9,10,10],[7,13,7,14],[8,13,8,14],[9,13,9,14],[10,13,10,14],[10,11,10,12],[12,5,12,6],[13,5,13,6],[4,13,4,14],[5,9,5,10],[6,9,6,10],[7,9,7,10],[8,9,8,10],[6,11,6,12],[7,11,7,12],[4,9,4,10],[8,11,8,12],[9,11,9,12],[8,5,8,6],[9,5,9,6],[11,9,11,10],[12,9,12,10],[13,9,13,10],[10,5,10,6],[4,11,4,12],[5,11,5,12],[12,13,12,14],[13,11,13,12],[13,13,13,14],[24,0,33,0],[12,1,12,3],[8,1,8,3],[9,1,9,3],[10,1,10,3],[11,1,11,3],[13,1,13,3],[14,1,14,3],[18,1,18,3],[19,1,19,3],[4,0,13,0],[14,0,23,0],[4,1,4,3],[5,1,5,3],[6,1,6,3],[7,1,7,3],[20,1,20,3],[21,1,21,3],[23,1,23,3],[16,1,16,3],[17,1,17,3],[24,1,24,3],[25,1,25,3],[26,1,26,3],[4,21,4,22],[5,21,5,22],[6,21,6,22],[7,21,7,22],[25,11,25,12],[7,19,7,20],[23,13,23,14],[23,19,23,20],[23,21,23,22],[13,19,13,20],[10,21,10,22],[11,13,11,14],[16,21,16,22],[17,21,17,22],[11,11,11,12],[14,21,14,22],[15,21,15,22],[11,19,11,20],[12,19,12,20],[11,21,11,22],[12,21,12,22],[12,11,12,12],[13,21,13,22],[21,21,21,22],[31,41,31,42],[5,41,5,42],[6,41,6,42],[7,41,7,42],[8,41,8,42],[9,41,9,42],[10,41,10,42],[12,41,12,42],[16,41,16,42],[17,41,17,42],[31,39,31,40],[25,31,25,32],[23,31,23,32],[24,39,24,40],[27,31,27,32],[30,39,30,40],[30,33,30,34],[27,39,27,40],[27,33,27,34],[31,33,31,34],[29,33,29,34],[5,23,5,24],[6,23,6,24],[7,29,7,30],[11,51,11,52],[12,51,12,52],[7,59,7,60],[7,51,7,52],[9,61,9,62],[10,61,10,62],[12,23,12,24],[7,43,7,44],[7,49,7,50],[6,49,6,50],[8,29,8,30],[8,23,8,24],[9,23,9,24],[7,23,7,24],[10,23,10,24],[5,33,5,34],[5,31,5,32],[6,31,6,32],[8,39,8,40],[9,33,9,34],[8,33,8,34],[19,21,19,22],[9,29,9,30],[8,59,8,60],[8,51,8,52],[11,49,11,50],[9,59,9,60],[9,51,9,52],[8,43,8,44],[8,49,8,50],[8,53,8,54],[11,23,11,24],[11,41,11,42],[10,43,10,44],[10,49,10,50],[8,21,8,22],[9,21,9,22],[13,29,13,30],[9,49,9,50],[10,53,10,54],[10,51,10,52],[13,49,13,50],[11,53,11,54],[11,59,11,60],[12,43,12,44],[31,51,31,52],[32,51,32,52],[27,43,27,44],[28,43,28,44],[29,43,29,44],[30,43,30,44],[31,49,31,50],[24,51,24,52],[25,51,25,52],[25,43,25,44],[3,5,3,22],[3,23,3,42],[3,43,3,62],[13,51,13,52],[14,51,14,52],[7,31,7,32],[8,31,8,32],[27,61,27,62],[23,61,23,62],[24,61,24,62],[25,61,25,62],[26,61,26,62],[19,61,19,62],[20,61,20,62],[16,61,16,62],[17,61,17,62],[18,61,18,62],[11,61,11,62],[22,51,22,52],[23,51,23,52],[12,61,12,62],[13,61,13,62],[14,61,14,62],[13,23,13,24],[3,64,3,69],[31,61,31,62],[32,61,32,62],[33,61,33,62],[28,61,28,62],[29,61,29,62],[30,61,30,62],[21,61,21,62],[22,61,22,62],[15,61,15,62],[4,61,4,62],[5,61,5,62],[6,61,6,62],[7,61,7,62],[8,61,8,62]]}
[{"$f":"【準備】登録!D2&【準備】登録!E2&【準備】登録!F2&\"　\"&【準備】登録!G2&【準備】登録!I2&\"　　　\"&\"(\"&【準備】登録!K6&\"；\"&【準備】登録!D6&\")\"","v":"第16回　和奈滋対抗戦　　　(奈良；キングスポット)"}]
[null,null,null,null,null,null,null,null,null,null,null,null,null,null,null,null,null,null,null,null,null,null,null,null,null,null,null,null,null,null,null,null,null,null,null,null,null,null,null,null,null,null,null,null,null,null,null,null,null,null,null,null,null,null,null,null,null,null,null,null,null,null,null,null,{"$f":"【準備】登録!D4","v":"2018-11-18"}]
[]
[null,null,null,null,null,"第１節",null,null,null,null,null,null,null,null,null,null,null,null,null,null,null,null,null,"第２節",null,null,null,null,null,null,null,null,null,null,null,null,null,null,null,null,null,null,null,"第３節",null,null,null,null,null,null,null,null,null,null,null,null,null,null,null,null,null,null,null,"順","HR記録",null,null,null,null,null,null,"HR",null,null,"HR_Point","Rank","氏名","クラブ","MAX",null,"途中経過"]
[{"$f":"IF(【準備】登録!B11=\"\",\"\",【準備】登録!B11)","v":"NRC"},"選手名",null,null,"持点",{"$f":"A25","v":"SBC"},null,"W","L","TP",null,"TP",null,{"$f":"A15","v":"WRC"},null,"W","L","W","L","TP",null,"TP",null,{"$f":"F5","v":"SBC"},null,"W","L","W","L","TP",null,"TP",null,{"$f":"N5","v":"WRC"},null,"W","L","W","L","TP",null,"TP",null,{"$f":"F5","v":"SBC"},null,"W","L","W","L","TP",null,"TP",null,{"$f":"N5","v":"WRC"},null,"W","L","W","L","TP",null,"TP",null,"R","1G","2G","3G","4G","5G","6G",null,"A","B","P",null,null,null,null,null,null,"W","L","TP","R_P",null,null,"MVP、VP"]
[null,{"$f":"IF(【準備】登録!$D$11=0,\"\",【準備】登録!$D$11)","v":"斉藤"},null,null,{"$f":"【準備】登録!F11","v":180},{"$f":"IF(【進行】結果入力表!F7=\"\",\"\",【進行】結果入力表!F7)","v":62},null,{"$f":"IF(F6=\"\",\"\",IF(F6=\"w\",1,0))","v":0},{"$f":"IF(F6=\"\",\"\",IF(F6=\"w\",0,1))","v":1},{"$f":"IF(F6=\"\",\"\",IF(F6=\"w\",E6,F6))","v":62},null,{"$f":"IF($F6=\"\",\"\",J6/$E6*180)","v":62},null,{"$f":"IF(【進行】結果入力表!F15=\"\",\"\",【進行】結果入力表!F15)","v":5},null,{"$f":"IF(N6=\"\",\"\",IF(N6=\"w\",1,0))","v":0},{"$f":"IF(N6=\"\",\"\",IF(N6=\"w\",0,1))","v":1},{"$f":"IF(N6=\"\",\"\",SUM(H6,P6))","v":0},{"$f":"IF(N6=\"\",\"\",SUM(I6,Q6))","v":2},{"$f":"IF(N6=\"\",\"\",IF(N6=\"w\",E6+J6,N6+J6))","v":67},null,{"$f":"IF($N6=\"\",\"\",T6/$E6*180)","v":67},null,{"$f":"IF(【進行】結果入力表!F33=\"\",\"\",【進行】結果入力表!F33)","v":107},null,{"$f":"IF(X6=\"\",\"\",IF(X6=\"w\",1,0))","v":0},{"$f":"IF(X6=\"\",\"\",IF(X6=\"w\",0,1))","v":1},{"$f":"IF(X6=\"\",\"\",SUM(R6,Z6))","v":0},{"$f":"IF(X6=\"\",\"\",SUM(S6,AA6))","v":3},{"$f":"IF(X6=\"\",\"\",IF(X6=\"w\",T6+E6,X6+T6))","v":174},null,{"$f":"IF($X6=\"\",\"\",AD6/$E6*180)","v":174},null,{"$f":"IF(【進行】結果入力表!F41=\"\",\"\",【進行】結果入力表!F41)","v":"w"},null,{"$f":"IF(AH6=\"\",\"\",IF(AH6=\"w\",1,0))","v":1},{"$f":"IF(AH6=\"\",\"\",IF(AH6=\"w\",0,1))","v":0},{"$f":"IF(AH6=\"\",\"\",SUM(AB6,AJ6))","v":1},{"$f":"IF(AH6=\"\",\"\",SUM(AC6,AK6))","v":3},{"$f":"IF(AH6=\"\",\"\",IF(AH6=\"w\",AD6+E6,AH6+AD6))","v":354},null,{"$f":"IF($AH6=\"\",\"\",AN6/$E6*180)","v":354},null,{"$f":"IF(【進行】結果入力表!F59=\"\",\"\",【進行】結果入力表!F59)","v":87},null,{"$f":"IF(AR6=\"\",\"\",IF(AR6=\"w\",1,0))","v":0},{"$f":"IF(AR6=\"\",\"\",IF(AR6=\"w\",0,1))","v":1},{"$f":"IF(AR6=\"\",\"\",IF(AR6=\"w\",AL6+1,AL6))","v":1},{"$f":"IF(AR6=\"\",\"\",IF(AR6=\"w\",AM6,AM6+1))","v":4},{"$f":"IF(AR6=\"\",\"\",IF(AR6=\"w\",AN6+E6,AR6+AN6))","v":441},null,{"$f":"IF($AR6=\"\",\"\",AX6/$E6*180)","v":441.00000000000006},null,{"$f":"IF(【進行】結果入力表!F67=\"\",\"\",【進行】結果入力表!F67)","v":"w"},null,{"$f":"IF(BB6=\"\",\"\",IF(BB6=\"w\",1,0))","v":1},{"$f":"IF(BB6=\"\",\"\",IF(BB6=\"w\",0,1))","v":0},{"$f":"IF(BB6=\"\",\"\",IF(BB6=\"w\",AV6+1,AV6))","v":2},{"$f":"IF(BB6=\"\",\"\",IF(BB6=\"w\",AW6,AW6+1))","v":4},{"$f":"IF(BB6=\"\",\"\",IF(BB6=\"w\",AX6+E6,BB6+AX6))","v":621},null,{"$f":"IF($BB6=\"\",\"\",BH6/$E6*180)","v":621},null,{"$f":"IF(SUM(H6:I6,R6:S6)=0,\"\",IF(B$13=\"\",RANK($CF$6:$CF$12,$CF$6:$CF$12,0),RANK($CF$6:$CF$13,$CF$6:$CF$13,0)))","v":7},{"$f":"IF(【進行】結果入力表!E7=\"\",\"\",【進行】結果入力表!E7)","v":""},{"$f":"IF(【進行】結果入力表!E15=\"\",\"\",【進行】結果入力表!E15)","v":""},{"$f":"IF(【進行】結果入力表!E33=\"\",\"\",【進行】結果入力表!E33)","v":""},{"$f":"IF(【進行】結果入力表!E41=\"\",\"\",【進行】結果入力表!E41)","v":""},{"$f":"IF(【進行】結果入力表!E59=\"\",\"\",【進行】結果入力表!E59)","v":""},{"$f":"IF(【進行】結果入力表!E67=\"\",\"\",【進行】結果入力表!E67)","v":""},null,{"$f":"COUNTIF($BM6:$BR6,BT$5)","v":0},{"$f":"COUNTIF($BM6:$BR6,BU$5)","v":0},{"$f":"MAX($BM6:$BR6)","v":0},{"$f":"BT6*10000+BU6*1000+BV6","v":0},{"$f":"RANK(BW6,$BW$6:$BW$33)","v":8},{"$f":"B6","v":"斉藤"},{"$f":"$A$5","v":"NRC"},{"$f":"IF(BT6>0,\"A\"&E6,IF(BU6>0,\"B\"&E6,BV6))","v":0},null,{"$f":"COUNTIF(F6:BC6,\"w\")","v":2},{"$f":"COUNT(F6,N6,AH6,X6,AR6,BB6)","v":4},{"$f":"CC6*180+SUM(F6,N6,AH6,X6,AR6,BB6)*180/E6","v":621},{"$f":"CC6*100000+CE6","v":200621},null,{"$f":"RANK(CK6,CK6:CK8,1)","v":1},{"$f":"A5","v":"NRC"},{"$f":"VLOOKUP(1,BL6:CF13,14,FALSE)","v":"吉向"},{"$f":"VLOOKUP(1,BL6:CF13,13,FALSE)","v":2}]
[null,{"$f":"IF(【準備】登録!$D$11=0,\"\",【準備】登録!$G$11)","v":"山田"},null,null,{"$f":"【準備】登録!I11","v":180},{"$f":"IF(【進行】結果入力表!F8=\"\",\"\",【進行】結果入力表!F8)","v":"w"},null,{"$f":"IF(F7=\"\",\"\",IF(F7=\"w\",1,0))","v":1},{"$f":"IF(F7=\"\",\"\",IF(F7=\"w\",0,1))","v":0},{"$f":"IF(F7=\"\",\"\",IF(F7=\"w\",E7,F7))","v":180},null,{"$f":"IF($F7=\"\",\"\",J7/$E7*180)","v":180},null,{"$f":"IF(【進行】結果入力表!F16=\"\",\"\",【進行】結果入力表!F16)","v":"w"},null,{"$f":"IF(N7=\"\",\"\",IF(N7=\"w\",1,0))","v":1},{"$f":"IF(N7=\"\",\"\",IF(N7=\"w\",0,1))","v":0},{"$f":"IF(N7=\"\",\"\",SUM(H7,P7))","v":2},{"$f":"IF(N7=\"\",\"\",SUM(I7,Q7))","v":0},360,null,360,null,{"$f":"IF(【進行】結果入力表!F34=\"\",\"\",【進行】結果入力表!F34)","v":"w"},null,{"$f":"IF(X7=\"\",\"\",IF(X7=\"w\",1,0))","v":1},{"$f":"IF(X7=\"\",\"\",IF(X7=\"w\",0,1))","v":0},{"$f":"IF(X7=\"\",\"\",SUM(R7,Z7))","v":3},{"$f":"IF(X7=\"\",\"\",SUM(S7,AA7))","v":0},540,null,540,null,{"$f":"IF(【進行】結果入力表!F42=\"\",\"\",【進行】結果入力表!F42)","v":"w"},null,{"$f":"IF(AH7=\"\",\"\",IF(AH7=\"w\",1,0))","v":1},{"$f":"IF(AH7=\"\",\"\",IF(AH7=\"w\",0,1))","v":0},{"$f":"IF(AH7=\"\",\"\",SUM(AB7,AJ7))","v":4},{"$f":"IF(AH7=\"\",\"\",SUM(AC7,AK7))","v":0},720,null,720,null,{"$f":"IF(【進行】結果入力表!F60=\"\",\"\",【進行】結果入力表!F60)","v":"w"},null,{"$f":"IF(AR7=\"\",\"\",IF(AR7=\"w\",1,0))","v":1},{"$f":"IF(AR7=\"\",\"\",IF(AR7=\"w\",0,1))","v":0},{"$f":"IF(AR7=\"\",\"\",IF(AR7=\"w\",AL7+1,AL7))","v":5},{"$f":"IF(AR7=\"\",\"\",IF(AR7=\"w\",AM7,AM7+1))","v":0},900,null,900,null,{"$f":"IF(【進行】結果入力表!F68=\"\",\"\",【進行】結果入力表!F68)","v":141},null,{"$f":"IF(BB7=\"\",\"\",IF(BB7=\"w\",1,0))","v":0},{"$f":"IF(BB7=\"\",\"\",IF(BB7=\"w\",0,1))","v":1},{"$f":"IF(BB7=\"\",\"\",IF(BB7=\"w\",AV7+1,AV7))","v":5},{"$f":"IF(BB7=\"\",\"\",IF(BB7=\"w\",AW7,AW7+1))","v":1},1041,null,1041,null,2,{"$f":"IF(【進行】結果入力表!E8=\"\",\"\",【進行】結果入力表!E8)","v":""},{"$f":"IF(【進行】結果入力表!E16=\"\",\"\",【進行】結果入力表!E16)","v":""},{"$f":"IF(【進行】結果入力表!E34=\"\",\"\",【進行】結果入力表!E34)","v":""},{"$f":"IF(【進行】結果入力表!E42=\"\",\"\",【進行】結果入力表!E42)","v":110},{"$f":"IF(【進行】結果入力表!E60=\"\",\"\",【進行】結果入力表!E60)","v":""},{"$f":"IF(【進行】結果入力表!E68=\"\",\"\",【進行】結果入力表!E68)","v":""},null,{"$f":"COUNTIF($BM7:$BR7,BT$5)","v":0},{"$f":"COUNTIF($BM7:$BR7,BU$5)","v":0},{"$f":"MAX($BM7:$BR7)","v":110},{"$f":"BT7*10000+BU7*1000+BV7","v":110},{"$f":"RANK(BW7,$BW$6:$BW$33)","v":5},{"$f":"B7","v":"山田"},{"$f":"$A$5","v":"NRC"},110,null,5,1,1041,{"$f":"CC7*100000+CE7","v":501041},null,{"$f":"RANK(CK7,CK6:CK8,1)","v":3},{"$f":"A15","v":"WRC"},{"$f":"VLOOKUP(1,BL16:CF23,14,FALSE)","v":"杉本"},{"$f":"VLOOKUP(1,BL16:CF23,13,FALSE)","v":8}]
[null,{"$f":"IF(【準備】登録!$D$11=0,\"\",【準備】登録!$J$11)","v":"吉向"},null,null,{"$f":"【準備】登録!L11","v":180},{"$f":"IF(【進行】結果入力表!F9=\"\",\"\",【進行】結果入力表!F9)","v":"w"},null,1,0,180,null,180,null,{"$f":"IF(【進行】結果入力表!F17=\"\",\"\",【進行】結果入力表!F17)","v":"w"},null,1,0,2,0,360,null,360,null,{"$f":"IF(【進行】結果入力表!F35=\"\",\"\",【進行】結果入力表!F35)","v":"w"},null,1,0,3,0,540,null,540,null,{"$f":"IF(【進行】結果入力表!F43=\"\",\"\",【進行】結果入力表!F43)","v":"w"},null,1,0,4,0,720,null,720,null,{"$f":"IF(【進行】結果入力表!F61=\"\",\"\",【進行】結果入力表!F61)","v":"w"},null,1,0,5,0,900,null,900,null,{"$f":"IF(【進行】結果入力表!F69=\"\",\"\",【進行】結果入力表!F69)","v":"w"},null,1,0,6,0,1080,null,1080,null,1,{"$f":"IF(【進行】結果入力表!E9=\"\",\"\",【進行】結果入力表!E9)","v":""},{"$f":"IF(【進行】結果入力表!E17=\"\",\"\",【進行】結果入力表!E17)","v":120},{"$f":"IF(【進行】結果入力表!E35=\"\",\"\",【進行】結果入力表!E35)","v":""},{"$f":"IF(【進行】結果入力表!E43=\"\",\"\",【進行】結果入力表!E43)","v":""},{"$f":"IF(【進行】結果入力表!E61=\"\",\"\",【進行】結果入力表!E61)","v":""},{"$f":"IF(【進行】結果入力表!E69=\"\",\"\",【進行】結果入力表!E69)","v":104},null,0,0,120,120,{"$f":"RANK(BW8,$BW$6:$BW$33)","v":2},"吉向","NRC",120,null,6,0,1080,601080,null,{"$f":"RANK(CK8,CK6:CK8,1)","v":2},{"$f":"A25","v":"SBC"},{"$f":"VLOOKUP(1,BL26:CF33,14,FALSE)","v":"林"},{"$f":"VLOOKUP(1,BL26:CF33,13,FALSE)","v":3}]
[null,{"$f":"IF(【準備】登録!$D$11=0,\"\",【準備】登録!$M$11)","v":"白戸"},null,null,{"$f":"【準備】登録!O11","v":180},{"$f":"IF(【進行】結果入力表!F10=\"\",\"\",【進行】結果入力表!F10)","v":"w"},null,1,0,180,null,180,null,{"$f":"IF(【進行】結果入力表!F18=\"\",\"\",【進行】結果入力表!F18)","v":57},null,0,1,1,1,237,null,237,null,{"$f":"IF(【進行】結果入力表!F36=\"\",\"\",【進行】結果入力表!F36)","v":"w"},null,1,0,2,1,417,null,417.00000000000006,null,{"$f":"IF(【進行】結果入力表!F44=\"\",\"\",【進行】結果入力表!F44)","v":"w"},null,1,0,3,1,597,null,597,null,{"$f":"IF(【進行】結果入力表!D$70=\"\",IF(【進行】結果入力表!F55=\"\",\"\",【進行】結果入力表!F55),IF(【進行】結果入力表!F62=\"\",\"\",【進行】結果入力表!F62))","v":"w"},null,1,0,4,1,777,null,777,null,{"$f":"IF(【進行】結果入力表!D$70=\"\",IF(【進行】結果入力表!F63=\"\",\"\",【進行】結果入力表!F63),IF(【進行】結果入力表!F70=\"\",\"\",【進行】結果入力表!F70))","v":117},null,0,1,4,2,894,null,894,null,4,{"$f":"IF(【進行】結果入力表!E10=\"\",\"\",【進行】結果入力表!E10)","v":""},{"$f":"IF(【進行】結果入力表!E18=\"\",\"\",【進行】結果入力表!E18)","v":""},{"$f":"IF(【進行】結果入力表!E36=\"\",\"\",【進行】結果入力表!E36)","v":""},{"$f":"IF(【進行】結果入力表!E44=\"\",\"\",【進行】結果入力表!E44)","v":""},{"$f":"IF(【進行】結果入力表!D$70=\"\",IF(【進行】結果入力表!E55=\"\",\"\",【進行】結果入力表!E55),IF(【進行】結果入力表!E62=\"\",\"\",【進行】結果入力表!E62))","v":""},{"$f":"IF(【進行】結果入力表!D$70=\"\",IF(【進行】結果入力表!E63=\"\",\"\",【進行】結果入力表!E63),IF(【進行】結果入力表!E70=\"\",\"\",【進行】結果入力表!E70))","v":""},null,0,0,0,0,{"$f":"RANK(BW9,$BW$6:$BW$33)","v":8},"白戸","NRC",0,null,4,2,894,400894]
[null,{"$f":"IF(【準備】登録!$D$11=0,\"\",【準備】登録!$P$11)","v":"植田"},null,null,{"$f":"【準備】登録!R11","v":180},{"$f":"IF(【進行】結果入力表!F11=\"\",\"\",【進行】結果入力表!F11)","v":"w"},null,1,0,180,null,180,null,{"$f":"IF(【進行】結果入力表!F19=\"\",\"\",【進行】結果入力表!F19)","v":"w"},null,1,0,2,0,360,null,360,null,{"$f":"IF(【進行】結果入力表!F37=\"\",\"\",【進行】結果入力表!F37)","v":"w"},null,1,0,3,0,540,null,540,null,{"$f":"IF(【進行】結果入力表!F45=\"\",\"\",【進行】結果入力表!F45)","v":"w"},null,1,0,4,0,720,null,720,null,{"$f":"IF(【進行】結果入力表!D$62=\"\",IF(【進行】結果入力表!F56=\"\",\"\",【進行】結果入力表!F56),IF(【進行】結果入力表!F55=\"\",\"\",【進行】結果入力表!F55))","v":"w"},null,1,0,5,0,900,null,900,null,{"$f":"IF(【進行】結果入力表!D$70=\"\",IF(【進行】結果入力表!F64=\"\",\"\",【進行】結果入力表!F64),IF(【進行】結果入力表!F63=\"\",\"\",【進行】結果入力表!F63))","v":84},null,0,1,5,1,984,null,984,null,3,{"$f":"IF(【進行】結果入力表!E11=\"\",\"\",【進行】結果入力表!E11)","v":""},{"$f":"IF(【進行】結果入力表!E19=\"\",\"\",【進行】結果入力表!E19)","v":""},{"$f":"IF(【進行】結果入力表!E37=\"\",\"\",【進行】結果入力表!E37)","v":""},{"$f":"IF(【進行】結果入力表!E45=\"\",\"\",【進行】結果入力表!E45)","v":""},{"$f":"IF(【進行】結果入力表!D$62=\"\",IF(【進行】結果入力表!E56=\"\",\"\",【進行】結果入力表!E56),IF(【進行】結果入力表!E55=\"\",\"\",【進行】結果入力表!E55))","v":""},{"$f":"IF(【進行】結果入力表!D$70=\"\",IF(【進行】結果入力表!E64=\"\",\"\",【進行】結果入力表!E64),IF(【進行】結果入力表!E63=\"\",\"\",【進行】結果入力表!E63))","v":""},null,0,0,0,0,8,"植田","NRC",0,null,5,1,984,500984]
[null,{"$f":"IF(【準備】登録!$D$11=0,\"\",【準備】登録!$S$11)","v":"岩本"},null,null,{"$f":"【準備】登録!U11","v":180},{"$f":"IF(【進行】結果入力表!F12=\"\",\"\",【進行】結果入力表!F12)","v":"w"},null,1,0,180,null,180,null,{"$f":"IF(【進行】結果入力表!F20=\"\",\"\",【進行】結果入力表!F20)","v":"w"},null,1,0,2,0,360,null,360,null,{"$f":"IF(【進行】結果入力表!D46=\"\",IF(【進行】結果入力表!F31=\"\",\"\",【進行】結果入力表!F31),IF(【進行】結果入力表!F38=\"\",\"\",【進行】結果入力表!F38))","v":48},null,0,1,2,1,408,null,408,null,{"$f":"IF(【進行】結果入力表!D46=\"\",IF(【進行】結果入力表!F39=\"\",\"\",【進行】結果入力表!F39),IF(【進行】結果入力表!F46=\"\",\"\",【進行】結果入力表!F46))","v":132},null,0,1,2,2,540,null,540,null,{"$f":"IF(【進行】結果入力表!D$62=\"\",IF(【進行】結果入力表!F57=\"\",\"\",【進行】結果入力表!F57),IF(【進行】結果入力表!F56=\"\",\"\",【進行】結果入力表!F56))","v":147},null,0,1,2,3,687,null,687,null,{"$f":"IF(【進行】結果入力表!D$70=\"\",IF(【進行】結果入力表!F65=\"\",\"\",【進行】結果入力表!F65),IF(【進行】結果入力表!F64=\"\",\"\",【進行】結果入力表!F64))","v":148},null,0,1,2,4,835,null,835.00000000000011,null,6,{"$f":"IF(【進行】結果入力表!E12=\"\",\"\",【進行】結果入力表!E12)","v":""},{"$f":"IF(【進行】結果入力表!E20=\"\",\"\",【進行】結果入力表!E20)","v":""},{"$f":"IF(【進行】結果入力表!D$46=\"\",IF(【進行】結果入力表!E31=\"\",\"\",【進行】結果入力表!E31),IF(【進行】結果入力表!E38=\"\",\"\",【進行】結果入力表!E38))","v":""},{"$f":"IF(【進行】結果入力表!D$46=\"\",IF(【進行】結果入力表!E39=\"\",\"\",【進行】結果入力表!E39),IF(【進行】結果入力表!E46=\"\",\"\",【進行】結果入力表!E46))","v":""},{"$f":"IF(【進行】結果入力表!D$62=\"\",IF(【進行】結果入力表!E57=\"\",\"\",【進行】結果入力表!E57),IF(【進行】結果入力表!E56=\"\",\"\",【進行】結果入力表!E56))","v":""},{"$f":"IF(【進行】結果入力表!D$70=\"\",IF(【進行】結果入力表!E65=\"\",\"\",【進行】結果入力表!E65),IF(【進行】結果入力表!E64=\"\",\"\",【進行】結果入力表!E64))","v":100},null,0,0,100,100,7,"岩本","NRC",100,null,2,4,835,200835]
[null,{"$f":"IF(【準備】登録!$D$11=0,\"\",【準備】登録!$V$11)","v":"白戸"},null,null,{"$f":"【準備】登録!X11","v":140},{"$f":"IF(【進行】結果入力表!F13=\"\",\"\",【進行】結果入力表!F13)","v":"w"},null,1,0,140,null,180,null,{"$f":"IF(【進行】結果入力表!F21=\"\",\"\",【進行】結果入力表!F21)","v":"w"},null,1,0,2,0,280,null,360,null,{"$f":"IF(【進行】結果入力表!D46=\"\",IF(【進行】結果入力表!F32=\"\",\"\",【進行】結果入力表!F32),IF(【進行】結果入力表!F31=\"\",\"\",【進行】結果入力表!F31))","v":96},null,0,1,2,1,376,null,483.42857142857139,null,{"$f":"IF(【進行】結果入力表!D46=\"\",IF(【進行】結果入力表!F40=\"\",\"\",【進行】結果入力表!F40),IF(【進行】結果入力表!F39=\"\",\"\",【進行】結果入力表!F39))","v":120},null,0,1,2,2,496,null,637.71428571428567,null,{"$f":"IF(【進行】結果入力表!D$62=\"\",IF(【進行】結果入力表!F58=\"\",\"\",【進行】結果入力表!F58),IF(【進行】結果入力表!F57=\"\",\"\",【進行】結果入力表!F57))","v":"w"},null,1,0,3,2,636,null,817.71428571428567,null,{"$f":"IF(【進行】結果入力表!D$70=\"\",IF(【進行】結果入力表!F66=\"\",\"\",【進行】結果入力表!F66),IF(【進行】結果入力表!F65=\"\",\"\",【進行】結果入力表!F65))","v":138},null,0,1,3,3,774,null,995.14285714285711,null,5,{"$f":"IF(【進行】結果入力表!E13=\"\",\"\",【進行】結果入力表!E13)","v":""},{"$f":"IF(【進行】結果入力表!E21=\"\",\"\",【進行】結果入力表!E21)","v":""},{"$f":"IF(【進行】結果入力表!D$46=\"\",IF(【進行】結果入力表!E32=\"\",\"\",【進行】結果入力表!E32),IF(【進行】結果入力表!E31=\"\",\"\",【進行】結果入力表!E31))","v":""},{"$f":"IF(【進行】結果入力表!D$46=\"\",IF(【進行】結果入力表!E40=\"\",\"\",【進行】結果入力表!E40),IF(【進行】結果入力表!E39=\"\",\"\",【進行】結果入力表!E39))","v":""},{"$f":"IF(【進行】結果入力表!D$62=\"\",IF(【進行】結果入力表!E58=\"\",\"\",【進行】結果入力表!E58),IF(【進行】結果入力表!E57=\"\",\"\",【進行】結果入力表!E57))","v":""},{"$f":"IF(【進行】結果入力表!D$70=\"\",IF(【進行】結果入力表!E66=\"\",\"\",【進行】結果入力表!E66),IF(【進行】結果入力表!E65=\"\",\"\",【進行】結果入力表!E65))","v":""},null,0,0,0,0,8,"白戸","NRC",0,null,3,3,995.14285714285711,300995.14285714284]
[null,{"$f":"IF(【準備】登録!$Y$11=0,\"\",【準備】登録!$Y$11)","v":""},null,null,{"$f":"IF(【準備】登録!$Y$11=\"\",\"\",【準備】登録!AA11)","v":""},{"$f":"IF(【進行】結果入力表!F14=\"\",\"\",【進行】結果入力表!F14)","v":""},null,{"$f":"IF(F13=\"\",\"\",IF(F13=\"w\",1,0))","v":""},{"$f":"IF(F13=\"\",\"\",IF(F13=\"w\",0,1))","v":""},"",null,"",null,{"$f":"IF(【進行】結果入力表!F22=\"\",\"\",【進行】結果入力表!F22)","v":""},null,"","","","","",null,"",null,{"$f":"IF(【進行】結果入力表!D46=\"\",\"\",IF(【進行】結果入力表!F32=\"\",\"\",【進行】結果入力表!F32))","v":""},null,"","","","","",null,"",null,{"$f":"IF(【進行】結果入力表!D46=\"\",\"\",IF(【進行】結果入力表!F40=\"\",\"\",【進行】結果入力表!F40))","v":""},null,"","","","","",null,"",null,{"$f":"IF(【進行】結果入力表!D62=\"\",\"\",IF(【進行】結果入力表!F58=\"\",\"\",【進行】結果入力表!F58))","v":""},null,"","",{"$f":"IF(AR13=\"\",\"\",IF(AR13=\"w\",AL13+1,AL13))","v":""},{"$f":"IF(AR13=\"\",\"\",IF(AR13=\"w\",AM13,AM13+1))","v":""},"",null,"",null,{"$f":"IF(【進行】結果入力表!D70=\"\",\"\",IF(【進行】結果入力表!F66=\"\",\"\",【進行】結果入力表!F66))","v":""},null,"","",{"$f":"IF(BB13=\"\",\"\",IF(BB13=\"w\",AV13+1,AV13))","v":""},{"$f":"IF(BB13=\"\",\"\",IF(BB13=\"w\",AW13,AW13+1))","v":""},"",null,"",null,"",{"$f":"IF(【進行】結果入力表!E14=\"\",\"\",【進行】結果入力表!E14)","v":""},{"$f":"IF(【進行】結果入力表!E22=\"\",\"\",【進行】結果入力表!E22)","v":""},{"$f":"IF(【進行】結果入力表!D46=\"\",\"\",IF(【進行】結果入力表!E32=\"\",\"\",【進行】結果入力表!E32))","v":""},{"$f":"IF(【進行】結果入力表!D46=\"\",\"\",IF(【進行】結果入力表!E40=\"\",\"\",【進行】結果入力表!E40))","v":""},{"$f":"IF(【進行】結果入力表!D70=\"\",\"\",IF(【進行】結果入力表!E58=\"\",\"\",【進行】結果入力表!E58))","v":""},{"$f":"IF(【進行】結果入力表!D70=\"\",\"\",IF(【進行】結果入力表!E66=\"\",\"\",【進行】結果入力表!E66))","v":""},null,0,0,0,0,8,"","NRC",0,null,{"$f":"IF(B13=\"\",\"\",COUNTIF(F13:BC13,\"w\"))","v":""},{"$f":"IF(B13=\"\",\"\",COUNT(F13,N13,AH13,X13,AR13,BB13))","v":""},{"$f":"IF(CC13=\"\",\"\",CC13*180+SUM(F13,N13,AH13,X13,AR13,BB13)*180/E13)","v":""},{"$f":"IF(B13=\"\",\"\",CC13*100000+CE13)","v":""}]
[null,"Total",null,null,null,null,null,{"$f":"IF(COUNTBLANK(H6:H13)=8,\"\",SUM(H6:H13))","v":6},{"$f":"IF(COUNTBLANK(I6:I13)=8,\"\",SUM(I6:I13))","v":1},{"$f":"IF($B6=\"\",\"\",SUM(J6:J13))","v":1102},{"$f":"IF($B6=\"\",\"\",SUM(K6:K13))","v":0},{"$f":"IF(COUNTBLANK(L6:L13)=8,\"\",SUM(L6:L13))","v":1142},{"$f":"IF($B6=\"\",\"\",SUM(M6:M13))","v":0},null,null,{"$f":"SUM(P6:P13)","v":5},{"$f":"SUM(Q6:Q13)","v":2},{"$f":"IF(COUNTBLANK(R6:R13)=8,\"\",SUM(H14,P14))","v":11},{"$f":"IF(COUNTBLANK(S6:S13)=8,\"\",SUM(I14,Q14))","v":3},{"$f":"IF($B6=\"\",\"\",SUM(T6:T13))","v":2024},{"$f":"IF($B6=\"\",\"\",SUM(U6:U13))","v":0},{"$f":"IF(COUNTBLANK(V6:V13)=8,\"\",SUM(V6:V13))","v":2104},{"$f":"IF($B6=\"\",\"\",SUM(W6:W13))","v":0},null,null,{"$f":"SUM(Z6:Z13)","v":4},{"$f":"SUM(AA6:AA13)","v":3},{"$f":"IF(COUNTBLANK(AB6:AB13)=8,\"\",SUM(R14,Z14))","v":15},{"$f":"IF(COUNTBLANK(AC6:AC13)=8,\"\",SUM(S14,AA14))","v":6},{"$f":"IF($B6=\"\",\"\",SUM(AD6:AD13))","v":2995},{"$f":"IF($B6=\"\",\"\",SUM(AE6:AE13))","v":0},{"$f":"IF(COUNTBLANK(AF6:AF13)=8,\"\",SUM(AF6:AF13))","v":3102.4285714285716},{"$f":"IF($B6=\"\",\"\",SUM(AG6:AG13))","v":0},null,null,{"$f":"SUM(AJ6:AJ13)","v":5},{"$f":"SUM(AK6:AK13)","v":2},{"$f":"IF(COUNTBLANK(AL6:AL13)=8,\"\",SUM(AB14,AJ14))","v":20},{"$f":"IF(COUNTBLANK(AM6:AM13)=8,\"\",SUM(AC14,AK14))","v":8},{"$f":"IF($B6=\"\",\"\",SUM(AN6:AN13))","v":4147},{"$f":"IF($B6=\"\",\"\",SUM(AO6:AO13))","v":0},{"$f":"IF(COUNTBLANK(AP6:AP13)=8,\"\",SUM(AP6:AP13))","v":4288.7142857142853},{"$f":"IF($B6=\"\",\"\",SUM(AQ6:AQ13))","v":0},null,null,{"$f":"SUM(AT6:AT13)","v":5},{"$f":"SUM(AU6:AU13)","v":2},{"$f":"IF(COUNTBLANK(AV6:AV13)=8,\"\",SUM(AL14,AT14))","v":25},{"$f":"IF(COUNTBLANK(AW6:AW13)=8,\"\",SUM(AM14,AU14))","v":10},{"$f":"IF($B6=\"\",\"\",SUM(AX6:AX13))","v":5241},{"$f":"IF($B6=\"\",\"\",SUM(AY6:AY13))","v":0},{"$f":"IF(COUNTBLANK(AZ6:AZ13)=8,\"\",SUM(AZ6:AZ13))","v":5422.7142857142853},{"$f":"IF($B6=\"\",\"\",SUM(BA6:BA13))","v":0},null,null,{"$f":"SUM(BD6:BD13)","v":2},{"$f":"SUM(BE6:BE13)","v":5},{"$f":"IF(COUNTBLANK(BF6:BF13)=8,\"\",SUM(AV14,BD14))","v":27},{"$f":"IF(COUNTBLANK(BG6:BG13)=8,\"\",SUM(AW14,BE14))","v":15},{"$f":"IF(COUNTIF(BH6:BI13,\"\")=16,\"\",SUM(BH6:BH13))","v":6229},{"$f":"IF($B6=\"\",\"\",SUM(BI6:BI13))","v":0},{"$f":"IF(COUNTBLANK(BJ6:BJ13)=8,\"\",SUM(BJ6:BJ13))","v":6450.1428571428569},{"$f":"IF($B6=\"\",\"\",SUM(BK6:BK13))","v":0},null,null,null,null,null,null,null,null,null,null,null,null,null,null,null,null,null,{"$f":"SUM(CC6:CC13)","v":27},{"$f":"SUM(CD6:CD13)","v":15},{"$f":"SUM(CE6:CE13)","v":6450.1428571428569},{"$f":"SUM(CF6:CF13)","v":2706450.1428571427}]
[{"$f":"IF(【準備】登録!B12=\"\",\"\",【準備】登録!B12)","v":"WRC"},{"$f":"B5","v":"選手名"},null,null,{"$f":"E5","v":"持点"},{"$f":"A5","v":"NRC"},null,"W","L","TP",null,"TP",null,{"$f":"A25","v":"SBC"},null,"W","L","W","L","TP",null,"TP",null,{"$f":"A5","v":"NRC"},null,"W","L","W","L","TP",null,"TP",null,{"$f":"A25","v":"SBC"},null,"W","L","W","L","TP",null,"TP",null,{"$f":"A5","v":"NRC"},null,"W","L","W","L","TP",null,"TP",null,{"$f":"A25","v":"SBC"},null,"W","L","W","L","TP",null,"TP",null,"R",{"$f":"BM$5","v":"1G"},"2G","3G","4G","5G","6G",null,null,null,null,null,null,null,null,null,null,{"$f":"CC$5","v":"W"},{"$f":"CD$5","v":"L"},{"$f":"CE$5","v":"TP"},{"$f":"CF$5","v":"R_P"}]
[null,{"$f":"IF(【準備】登録!$D$11=0,\"\",【準備】登録!$D$12)","v":"和田"},null,null,{"$f":"【準備】登録!F12","v":180},{"$f":"IF(【進行】結果入力表!G15=\"\",\"\",【進行】結果入力表!G15)","v":"w"},null,{"$f":"IF(F16=\"\",\"\",IF(F16=\"w\",1,0))","v":1},{"$f":"IF(F16=\"\",\"\",IF(F16=\"w\",0,1))","v":0},{"$f":"IF(F16=\"\",\"\",IF(F16=\"w\",E16,F16))","v":180},null,{"$f":"IF($F16=\"\",\"\",J16/$E16*180)","v":180},null,{"$f":"IF(【進行】結果入力表!F23=\"\",\"\",【進行】結果入力表!F23)","v":"w"},null,{"$f":"IF(N16=\"\",\"\",IF(N16=\"w\",1,0))","v":1},{"$f":"IF(N16=\"\",\"\",IF(N16=\"w\",0,1))","v":0},{"$f":"IF(N16=\"\",\"\",SUM(H16,P16))","v":2},{"$f":"IF(N16=\"\",\"\",SUM(I16,Q16))","v":0},{"$f":"IF(N16=\"\",\"\",IF(N16=\"w\",E16+J16,N16+J16))","v":360},null,{"$f":"IF($N16=\"\",\"\",T16/$E16*180)","v":360},null,{"$f":"IF(【進行】結果入力表!G40=\"\",\"\",【進行】結果入力表!G40)","v":"w"},null,{"$f":"IF(X16=\"\",\"\",IF(X16=\"w\",1,0))","v":1},{"$f":"IF(X16=\"\",\"\",IF(X16=\"w\",0,1))","v":0},{"$f":"IF(X16=\"\",\"\",SUM(R16,Z16))","v":3},{"$f":"IF(X16=\"\",\"\",SUM(S16,AA16))","v":0},{"$f":"IF(X16=\"\",\"\",IF(X16=\"w\",T16+E16,X16+T16))","v":540},null,{"$f":"IF($X16=\"\",\"\",AD16/$E16*180)","v":540},null,{"$f":"IF(【進行】結果入力表!F48=\"\",\"\",【進行】結果入力表!F48)","v":98},null,{"$f":"IF(AH16=\"\",\"\",IF(AH16=\"w\",1,0))","v":0},{"$f":"IF(AH16=\"\",\"\",IF(AH16=\"w\",0,1))","v":1},{"$f":"IF(AH16=\"\",\"\",SUM(AB16,AJ16))","v":3},{"$f":"IF(AH16=\"\",\"\",SUM(AC16,AK16))","v":1},{"$f":"IF(AH16=\"\",\"\",IF(AH16=\"w\",AD16+E16,AH16+AD16))","v":638},null,{"$f":"IF($AH16=\"\",\"\",AN16/$E16*180)","v":638},null,{"$f":"IF(【進行】結果入力表!G65=\"\",\"\",【進行】結果入力表!G65)","v":"w"},null,{"$f":"IF(AR16=\"\",\"\",IF(AR16=\"w\",1,0))","v":1},{"$f":"IF(AR16=\"\",\"\",IF(AR16=\"w\",0,1))","v":0},{"$f":"IF(AR16=\"\",\"\",IF(AR16=\"w\",AL16+1,AL16))","v":4},{"$f":"IF(AR16=\"\",\"\",IF(AR16=\"w\",AM16,AM16+1))","v":1},{"$f":"IF(AR16=\"\",\"\",IF(AR16=\"w\",AN16+E16,AR16+AN16))","v":818},null,{"$f":"IF($AR16=\"\",\"\",AX16/$E16*180)","v":818},null,{"$f":"IF(【進行】結果入力表!F73=\"\",\"\",【進行】結果入力表!F73)","v":92},null,{"$f":"IF(BB16=\"\",\"\",IF(BB16=\"w\",1,0))","v":0},{"$f":"IF(BB16=\"\",\"\",IF(BB16=\"w\",0,1))","v":1},{"$f":"IF(BB16=\"\",\"\",IF(BB16=\"w\",AV16+1,AV16))","v":4},{"$f":"IF(BB16=\"\",\"\",IF(BB16=\"w\",AW16,AW16+1))","v":2},{"$f":"IF(BB16=\"\",\"\",IF(BB16=\"w\",AX16+E16,BB16+AX16))","v":910},null,{"$f":"IF($BB16=\"\",\"\",BH16/$E16*180)","v":910},null,{"$f":"IF(SUM(H16:I16,R16:S16)=0,\"\",IF(B$13=\"\",RANK($CF$16:$CF$22,$CF$16:$CF$22,0),RANK($CF$16:$CF$23,$CF$16:$CF$23,0)))","v":3},{"$f":"IF(【進行】結果入力表!H15=\"\",\"\",【進行】結果入力表!H15)","v":111},{"$f":"IF(【進行】結果入力表!E23=\"\",\"\",【進行】結果入力表!E23)","v":""},{"$f":"IF(【進行】結果入力表!H40=\"\",\"\",【進行】結果入力表!H40)","v":""},{"$f":"IF(【進行】結果入力表!E48=\"\",\"\",【進行】結果入力表!E48)","v":""},{"$f":"IF(【進行】結果入力表!H65=\"\",\"\",【進行】結果入力表!H65)","v":104},{"$f":"IF(【進行】結果入力表!E73=\"\",\"\",【進行】結果入力表!E73)","v":""},null,{"$f":"COUNTIF($BM16:$BR16,BT$5)","v":0},{"$f":"COUNTIF($BM16:$BR16,BU$5)","v":0},{"$f":"MAX($BM16:$BR16)","v":111},{"$f":"BT16*10000+BU16*1000+BV16","v":111},4,{"$f":"B16","v":"和田"},{"$f":"$A$15","v":"WRC"},{"$f":"IF(BT16>0,\"A\"&E16,IF(BU16>0,\"B\"&E16,BV16))","v":111},null,{"$f":"COUNTIF(F16:BC16,\"w\")","v":4},{"$f":"COUNT(F16,N16,AH16,X16,AR16,BB16)","v":2},{"$f":"CC16*180+SUM(F16,N16,AH16,X16,AR16,BB16)*180/E16","v":910},{"$f":"CC16*100000+CE16","v":400910}]
[null,{"$f":"IF(【準備】登録!$D$11=0,\"\",【準備】登録!$G$12)","v":"山中"},null,null,{"$f":"【準備】登録!I12","v":180},{"$f":"IF(【進行】結果入力表!G16=\"\",\"\",【進行】結果入力表!G16)","v":134},null,{"$f":"IF(F17=\"\",\"\",IF(F17=\"w\",1,0))","v":0},{"$f":"IF(F17=\"\",\"\",IF(F17=\"w\",0,1))","v":1},{"$f":"IF(F17=\"\",\"\",IF(F17=\"w\",E17,F17))","v":134},null,{"$f":"IF($F17=\"\",\"\",J17/$E17*180)","v":134},null,{"$f":"IF(【進行】結果入力表!F24=\"\",\"\",【進行】結果入力表!F24)","v":159},null,{"$f":"IF(N17=\"\",\"\",IF(N17=\"w\",1,0))","v":0},{"$f":"IF(N17=\"\",\"\",IF(N17=\"w\",0,1))","v":1},{"$f":"IF(N17=\"\",\"\",SUM(H17,P17))","v":0},{"$f":"IF(N17=\"\",\"\",SUM(I17,Q17))","v":2},293,null,293,null,{"$f":"IF(【進行】結果入力表!G41=\"\",\"\",【進行】結果入力表!G41)","v":15},null,{"$f":"IF(X17=\"\",\"\",IF(X17=\"w\",1,0))","v":0},{"$f":"IF(X17=\"\",\"\",IF(X17=\"w\",0,1))","v":1},{"$f":"IF(X17=\"\",\"\",SUM(R17,Z17))","v":0},{"$f":"IF(X17=\"\",\"\",SUM(S17,AA17))","v":3},308,null,308,null,{"$f":"IF(【進行】結果入力表!F49=\"\",\"\",【進行】結果入力表!F49)","v":"w"},null,{"$f":"IF(AH17=\"\",\"\",IF(AH17=\"w\",1,0))","v":1},{"$f":"IF(AH17=\"\",\"\",IF(AH17=\"w\",0,1))","v":0},{"$f":"IF(AH17=\"\",\"\",SUM(AB17,AJ17))","v":1},{"$f":"IF(AH17=\"\",\"\",SUM(AC17,AK17))","v":3},488,null,488,null,{"$f":"IF(【進行】結果入力表!G66=\"\",\"\",【進行】結果入力表!G66)","v":"w"},null,{"$f":"IF(AR17=\"\",\"\",IF(AR17=\"w\",1,0))","v":1},{"$f":"IF(AR17=\"\",\"\",IF(AR17=\"w\",0,1))","v":0},2,3,668,null,668,null,{"$f":"IF(【進行】結果入力表!F74=\"\",\"\",【進行】結果入力表!F74)","v":131},null,{"$f":"IF(BB17=\"\",\"\",IF(BB17=\"w\",1,0))","v":0},{"$f":"IF(BB17=\"\",\"\",IF(BB17=\"w\",0,1))","v":1},2,4,799,null,799,null,6,{"$f":"IF(【進行】結果入力表!H16=\"\",\"\",【進行】結果入力表!H16)","v":""},{"$f":"IF(【進行】結果入力表!E24=\"\",\"\",【進行】結果入力表!E24)","v":""},{"$f":"IF(【進行】結果入力表!H41=\"\",\"\",【進行】結果入力表!H41)","v":""},{"$f":"IF(【進行】結果入力表!E49=\"\",\"\",【進行】結果入力表!E49)","v":""},{"$f":"IF(【進行】結果入力表!H66=\"\",\"\",【進行】結果入力表!H66)","v":""},{"$f":"IF(【進行】結果入力表!E74=\"\",\"\",【進行】結果入力表!E74)","v":""},null,{"$f":"COUNTIF($BM17:$BR17,BT$5)","v":0},0,{"$f":"MAX($BM17:$BR17)","v":0},{"$f":"BT17*10000+BU17*1000+BV17","v":0},8,{"$f":"B17","v":"山中"},{"$f":"$A$15","v":"WRC"},0,null,2,4,799,{"$f":"CC17*100000+CE17","v":200799}]
[null,{"$f":"IF(【準備】登録!$D$11=0,\"\",【準備】登録!$J$12)","v":"末岡"},null,null,{"$f":"【準備】登録!L12","v":180},{"$f":"IF(【進行】結果入力表!G17=\"\",\"\",【進行】結果入力表!G17)","v":164},null,0,1,164,null,164,null,{"$f":"IF(【進行】結果入力表!F25=\"\",\"\",【進行】結果入力表!F25)","v":"w"},null,1,0,1,1,344,null,344,null,{"$f":"IF(【進行】結果入力表!G42=\"\",\"\",【進行】結果入力表!G42)","v":145},null,0,1,1,2,489,null,489,null,{"$f":"IF(【進行】結果入力表!F50=\"\",\"\",【進行】結果入力表!F50)","v":"w"},null,1,0,2,2,669,null,669,null,{"$f":"IF(【進行】結果入力表!G67=\"\",\"\",【進行】結果入力表!G67)","v":92},null,0,1,2,3,761,null,761,null,{"$f":"IF(【進行】結果入力表!F75=\"\",\"\",【進行】結果入力表!F75)","v":"w"},null,1,0,3,3,941,null,941,null,4,{"$f":"IF(【進行】結果入力表!H17=\"\",\"\",【進行】結果入力表!H17)","v":""},{"$f":"IF(【進行】結果入力表!E25=\"\",\"\",【進行】結果入力表!E25)","v":135},{"$f":"IF(【進行】結果入力表!H42=\"\",\"\",【進行】結果入力表!H42)","v":""},{"$f":"IF(【進行】結果入力表!E50=\"\",\"\",【進行】結果入力表!E50)","v":""},{"$f":"IF(【進行】結果入力表!H67=\"\",\"\",【進行】結果入力表!H67)","v":""},{"$f":"IF(【進行】結果入力表!E75=\"\",\"\",【進行】結果入力表!E75)","v":""},null,0,0,135,135,1,"末岡","WRC",135,null,3,3,941,300941]
[null,{"$f":"IF(【準備】登録!$D$11=0,\"\",【準備】登録!$M$12)","v":"杉本"},null,null,{"$f":"【準備】登録!O12","v":180},{"$f":"IF(【進行】結果入力表!G18=\"\",\"\",【進行】結果入力表!G18)","v":"w"},null,1,0,180,null,180,null,{"$f":"IF(【進行】結果入力表!F26=\"\",\"\",【進行】結果入力表!F26)","v":"w"},null,1,0,2,0,360,null,360,null,{"$f":"IF(【進行】結果入力表!G43=\"\",\"\",【進行】結果入力表!G43)","v":164},null,0,1,2,1,524,null,524,null,{"$f":"IF(【進行】結果入力表!F51=\"\",\"\",【進行】結果入力表!F51)","v":"w"},null,1,0,3,1,704,null,704,null,{"$f":"IF(【進行】結果入力表!G68=\"\",\"\",【進行】結果入力表!G68)","v":"w"},null,1,0,4,1,884,null,884,null,{"$f":"IF(【進行】結果入力表!F76=\"\",\"\",【進行】結果入力表!F76)","v":"w"},null,1,0,5,1,1064,null,1064,null,1,{"$f":"IF(【進行】結果入力表!H18=\"\",\"\",【進行】結果入力表!H18)","v":""},{"$f":"IF(【進行】結果入力表!E26=\"\",\"\",【進行】結果入力表!E26)","v":""},{"$f":"IF(【進行】結果入力表!H43=\"\",\"\",【進行】結果入力表!H43)","v":""},{"$f":"IF(【進行】結果入力表!E51=\"\",\"\",【進行】結果入力表!E51)","v":""},{"$f":"IF(【進行】結果入力表!H68=\"\",\"\",【進行】結果入力表!H68)","v":""},{"$f":"IF(【進行】結果入力表!E76=\"\",\"\",【進行】結果入力表!E76)","v":""},null,0,0,0,0,8,"杉本","WRC",0,null,5,1,1064,501064]
[null,{"$f":"IF(【準備】登録!$D$11=0,\"\",【準備】登録!$P$12)","v":"大迫"},null,null,{"$f":"【準備】登録!R12","v":180},{"$f":"IF(【進行】結果入力表!G19=\"\",\"\",【進行】結果入力表!G19)","v":21},null,0,1,21,null,21,null,{"$f":"IF(【進行】結果入力表!F27=\"\",\"\",【進行】結果入力表!F27)","v":74},null,0,1,0,2,95,null,95,null,{"$f":"IF(【進行】結果入力表!G44=\"\",\"\",【進行】結果入力表!G44)","v":48},null,0,1,0,3,143,null,143,null,{"$f":"IF(【進行】結果入力表!F52=\"\",\"\",【進行】結果入力表!F52)","v":142},null,0,1,0,4,285,null,285,null,{"$f":"IF(【進行】結果入力表!G69=\"\",\"\",【進行】結果入力表!G69)","v":165},null,0,1,0,5,450,null,450,null,{"$f":"IF(【進行】結果入力表!F77=\"\",\"\",【進行】結果入力表!F77)","v":52},null,0,1,0,6,502,null,502,null,7,{"$f":"IF(【進行】結果入力表!H19=\"\",\"\",【進行】結果入力表!H19)","v":""},{"$f":"IF(【進行】結果入力表!E27=\"\",\"\",【進行】結果入力表!E27)","v":""},{"$f":"IF(【進行】結果入力表!H44=\"\",\"\",【進行】結果入力表!H44)","v":""},{"$f":"IF(【進行】結果入力表!E52=\"\",\"\",【進行】結果入力表!E52)","v":""},{"$f":"IF(【進行】結果入力表!H69=\"\",\"\",【進行】結果入力表!H69)","v":""},{"$f":"IF(【進行】結果入力表!E77=\"\",\"\",【進行】結果入力表!E77)","v":""},null,0,0,0,0,8,"大迫","WRC",0,null,0,6,502,502]
[null,{"$f":"IF(【準備】登録!$D$11=0,\"\",【準備】登録!$S$12)","v":"中本"},null,null,{"$f":"【準備】登録!U12","v":180},{"$f":"IF(【進行】結果入力表!G20=\"\",\"\",【進行】結果入力表!G20)","v":113},null,0,1,113,null,113,null,{"$f":"IF(【進行】結果入力表!F28=\"\",\"\",【進行】結果入力表!F28)","v":"w"},null,1,0,1,1,293,null,293,null,{"$f":"IF(【進行】結果入力表!G45=\"\",\"\",【進行】結果入力表!G45)","v":141},null,0,1,1,2,434,null,434,null,{"$f":"IF(【進行】結果入力表!F53=\"\",\"\",【進行】結果入力表!F53)","v":156},null,0,1,1,3,590,null,590,null,{"$f":"IF(【進行】結果入力表!I70=\"\",IF(【進行】結果入力表!G63=\"\",\"\",【進行】結果入力表!G63),IF(【進行】結果入力表!G70=\"\",\"\",【進行】結果入力表!G70))","v":"w"},null,1,0,2,3,770,null,770,null,{"$f":"IF(【進行】結果入力表!$D$78=\"\",IF(【進行】結果入力表!F71=\"\",\"\",【進行】結果入力表!F71),IF(【進行】結果入力表!F78=\"\",\"\",【進行】結果入力表!F78))","v":131},null,0,1,2,4,901,null,901,null,5,{"$f":"IF(【進行】結果入力表!H20=\"\",\"\",【進行】結果入力表!H20)","v":""},{"$f":"IF(【進行】結果入力表!E28=\"\",\"\",【進行】結果入力表!E28)","v":""},{"$f":"IF(【進行】結果入力表!H45=\"\",\"\",【進行】結果入力表!H45)","v":""},{"$f":"IF(【進行】結果入力表!E53=\"\",\"\",【進行】結果入力表!E53)","v":""},{"$f":"IF(【進行】結果入力表!I70=\"\",IF(【進行】結果入力表!H63=\"\",\"\",【進行】結果入力表!H63),IF(【進行】結果入力表!H70=\"\",\"\",【進行】結果入力表!H70))","v":""},{"$f":"IF(【進行】結果入力表!D78=\"\",IF(【進行】結果入力表!E71=\"\",\"\",【進行】結果入力表!E71),IF(【進行】結果入力表!E78=\"\",\"\",【進行】結果入力表!E78))","v":""},null,0,0,0,0,8,"中本","WRC",0,null,2,4,901,200901]
[null,{"$f":"IF(【準備】登録!$D$11=0,\"\",【準備】登録!$V$12)","v":"松房"},null,null,{"$f":"【準備】登録!X12","v":140},{"$f":"IF(【進行】結果入力表!G21=\"\",\"\",【進行】結果入力表!G21)","v":99},null,0,1,99,null,127.28571428571429,null,{"$f":"IF(【進行】結果入力表!F29=\"\",\"\",【進行】結果入力表!F29)","v":"w"},null,1,0,1,1,239,null,307.28571428571428,null,{"$f":"IF(【進行】結果入力表!I46=\"\",IF(【進行】結果入力表!G39=\"\",\"\",【進行】結果入力表!G39),IF(【進行】結果入力表!G46=\"\",\"\",【進行】結果入力表!G46))","v":"w"},null,1,0,2,1,379,null,487.28571428571433,null,{"$f":"IF(【進行】結果入力表!$D$54=\"\",IF(【進行】結果入力表!F47=\"\",\"\",【進行】結果入力表!F47),IF(【進行】結果入力表!F54=\"\",\"\",【進行】結果入力表!F54))","v":"w"},null,1,0,3,1,519,null,667.28571428571433,null,{"$f":"IF(【進行】結果入力表!I70=\"\",IF(【進行】結果入力表!G64=\"\",\"\",【進行】結果入力表!G64),IF(【進行】結果入力表!G63=\"\",\"\",【進行】結果入力表!G63))","v":"w"},null,1,0,4,1,659,null,847.28571428571433,null,{"$f":"IF(【進行】結果入力表!$D$78=\"\",IF(【進行】結果入力表!F72=\"\",\"\",【進行】結果入力表!F72),IF(【進行】結果入力表!F71=\"\",\"\",【進行】結果入力表!F71))","v":"w"},null,1,0,5,1,799,null,1027.2857142857142,null,2,{"$f":"IF(【進行】結果入力表!H21=\"\",\"\",【進行】結果入力表!H21)","v":""},{"$f":"IF(【進行】結果入力表!E29=\"\",\"\",【進行】結果入力表!E29)","v":""},{"$f":"IF(【進行】結果入力表!I46=\"\",IF(【進行】結果入力表!H39=\"\",\"\",【進行】結果入力表!H39),IF(【進行】結果入力表!H46=\"\",\"\",【進行】結果入力表!H46))","v":""},{"$f":"IF(【進行】結果入力表!D54=\"\",IF(【進行】結果入力表!E47=\"\",\"\",【進行】結果入力表!E47),IF(【進行】結果入力表!E54=\"\",\"\",【進行】結果入力表!E54))","v":""},{"$f":"IF(【進行】結果入力表!I70=\"\",IF(【進行】結果入力表!H64=\"\",\"\",【進行】結果入力表!H64),IF(【進行】結果入力表!H63=\"\",\"\",【進行】結果入力表!H63))","v":""},{"$f":"IF(【進行】結果入力表!D78=\"\",IF(【進行】結果入力表!E72=\"\",\"\",【進行】結果入力表!E72),IF(【進行】結果入力表!E71=\"\",\"\",【進行】結果入力表!E71))","v":""},null,0,0,0,0,8,"松房","WRC",0,null,5,1,1027.2857142857142,501027.28571428574]
[null,{"$f":"IF(【準備】登録!$Y$12=0,\"\",【準備】登録!$Y$12)","v":""},null,null,{"$f":"IF(【準備】登録!$Y$12=\"\",\"\",【準備】登録!AA12)","v":""},{"$f":"IF(【進行】結果入力表!G22=\"\",\"\",【進行】結果入力表!G22)","v":""},null,{"$f":"IF(F23=\"\",\"\",IF(F23=\"w\",1,0))","v":""},{"$f":"IF(F23=\"\",\"\",IF(F23=\"w\",0,1))","v":""},"",null,"",null,{"$f":"IF(【進行】結果入力表!F30=\"\",\"\",【進行】結果入力表!F30)","v":""},null,"","","","","",null,"",null,{"$f":"IF(【進行】結果入力表!I46=\"\",\"\",IF(【進行】結果入力表!G39=\"\",\"\",【進行】結果入力表!G39))","v":""},null,"","","","","",null,"",null,{"$f":"IF(【進行】結果入力表!D54=\"\",\"\",IF(【進行】結果入力表!F47=\"\",\"\",【進行】結果入力表!F47))","v":""},null,"","","","","",null,"",null,{"$f":"IF(【進行】結果入力表!I70=\"\",\"\",IF(【進行】結果入力表!G64=\"\",\"\",【進行】結果入力表!G64))","v":""},null,"","","","","",null,"",null,{"$f":"IF(【進行】結果入力表!D78=\"\",\"\",IF(【進行】結果入力表!F72=\"\",\"\",【進行】結果入力表!F72))","v":""},null,"","","","","",null,"",null,"",{"$f":"IF(【進行】結果入力表!H22=\"\",\"\",【進行】結果入力表!H22)","v":""},{"$f":"IF(【進行】結果入力表!E30=\"\",\"\",【進行】結果入力表!E30)","v":""},{"$f":"IF(【進行】結果入力表!I46=\"\",\"\",IF(【進行】結果入力表!H39=\"\",\"\",【進行】結果入力表!H39))","v":""},{"$f":"IF(【進行】結果入力表!D54=\"\",\"\",IF(【進行】結果入力表!E47=\"\",\"\",【進行】結果入力表!E47))","v":""},{"$f":"IF(【進行】結果入力表!I70=\"\",\"\",IF(【進行】結果入力表!H64=\"\",\"\",【進行】結果入力表!H64))","v":""},{"$f":"IF(【進行】結果入力表!D78=\"\",\"\",IF(【進行】結果入力表!E72=\"\",\"\",【進行】結果入力表!E72))","v":""},null,0,0,0,0,8,"","WRC",0,null,{"$f":"IF(B23=\"\",\"\",COUNTIF(F23:BC23,\"w\"))","v":""},{"$f":"IF(B23=\"\",\"\",COUNT(F23,N23,AH23,X23,AR23,BB23))","v":""},{"$f":"IF(CC23=\"\",\"\",CC23*180+SUM(F23,N23,AH23,X23,AR23,BB23)*180/E23)","v":""},{"$f":"IF(B23=\"\",\"\",CC23*100000+CE23)","v":""}]
[null,"Total",null,null,null,null,null,{"$f":"IF(COUNTBLANK(H16:H23)=8,\"\",SUM(H16:H23))","v":2},{"$f":"IF(COUNTBLANK(I16:I23)=8,\"\",SUM(I16:I23))","v":5},{"$f":"IF($B16=\"\",\"\",SUM(J16:J23))","v":891},{"$f":"IF($B16=\"\",\"\",SUM(K16:K23))","v":0},{"$f":"IF(COUNTBLANK(L16:L23)=8,\"\",SUM(L16:L23))","v":919.28571428571433},{"$f":"IF($B16=\"\",\"\",SUM(M16:M23))","v":0},null,null,{"$f":"SUM(P16:P23)","v":5},{"$f":"SUM(Q16:Q23)","v":2},{"$f":"IF(COUNTBLANK(R16:R23)=8,\"\",SUM(H24,P24))","v":7},{"$f":"IF(COUNTBLANK(S16:S23)=8,\"\",SUM(I24,Q24))","v":7},{"$f":"IF($B16=\"\",\"\",SUM(T16:T23))","v":1984},{"$f":"IF($B16=\"\",\"\",SUM(U16:U23))","v":0},{"$f":"IF(COUNTBLANK(V16:V23)=8,\"\",SUM(V16:V23))","v":2052.2857142857142},{"$f":"IF($B16=\"\",\"\",SUM(W16:W23))","v":0},null,null,{"$f":"SUM(Z16:Z23)","v":2},{"$f":"SUM(AA16:AA23)","v":5},{"$f":"IF(COUNTBLANK(AB16:AB23)=8,\"\",SUM(R24,Z24))","v":9},{"$f":"IF(COUNTBLANK(AC16:AC23)=8,\"\",SUM(S24,AA24))","v":12},{"$f":"IF($B16=\"\",\"\",SUM(AD16:AD23))","v":2817},{"$f":"IF($B16=\"\",\"\",SUM(AE16:AE23))","v":0},{"$f":"IF(COUNTBLANK(AF16:AF23)=8,\"\",SUM(AF16:AF23))","v":2925.2857142857142},{"$f":"IF($B16=\"\",\"\",SUM(AG16:AG23))","v":0},null,null,{"$f":"SUM(AJ16:AJ23)","v":4},{"$f":"SUM(AK16:AK23)","v":3},{"$f":"IF(COUNTBLANK(AL16:AL23)=8,\"\",SUM(AB24,AJ24))","v":13},{"$f":"IF(COUNTBLANK(AM16:AM23)=8,\"\",SUM(AC24,AK24))","v":15},{"$f":"IF($B16=\"\",\"\",SUM(AN16:AN23))","v":3893},{"$f":"IF($B16=\"\",\"\",SUM(AO16:AO23))","v":0},{"$f":"IF(COUNTBLANK(AP16:AP23)=8,\"\",SUM(AP16:AP23))","v":4041.2857142857142},{"$f":"IF($B16=\"\",\"\",SUM(AQ16:AQ23))","v":0},null,null,{"$f":"SUM(AT16:AT23)","v":5},{"$f":"SUM(AU16:AU23)","v":2},{"$f":"IF(COUNTBLANK(AV16:AV23)=8,\"\",SUM(AL24,AT24))","v":18},{"$f":"IF(COUNTBLANK(AW16:AW23)=8,\"\",SUM(AM24,AU24))","v":17},{"$f":"IF($B16=\"\",\"\",SUM(AX16:AX23))","v":5010},{"$f":"IF($B16=\"\",\"\",SUM(AY16:AY23))","v":0},{"$f":"IF(COUNTBLANK(AZ16:AZ23)=8,\"\",SUM(AZ16:AZ23))","v":5198.2857142857147},{"$f":"IF($B16=\"\",\"\",SUM(BA16:BA23))","v":0},null,null,{"$f":"SUM(BD16:BD23)","v":3},{"$f":"SUM(BE16:BE23)","v":4},{"$f":"IF(COUNTBLANK(BF16:BF23)=8,\"\",SUM(AV24,BD24))","v":21},{"$f":"IF(COUNTBLANK(BG16:BG23)=8,\"\",SUM(AW24,BE24))","v":21},{"$f":"IF(COUNTIF(BH16:BI23,\"\")=16,\"\",SUM(BH16:BH23))","v":5916},{"$f":"IF($B16=\"\",\"\",SUM(BI16:BI23))","v":0},{"$f":"IF(COUNTBLANK(BJ16:BJ23)=8,\"\",SUM(BJ16:BJ23))","v":6144.2857142857138},{"$f":"IF($B16=\"\",\"\",SUM(BK16:BK23))","v":0},null,null,null,null,null,null,null,null,null,null,null,null,null,null,"WRC",null,null,{"$f":"SUM(CC16:CC23)","v":21},{"$f":"SUM(CD16:CD23)","v":21},{"$f":"SUM(CE16:CE23)","v":6144.2857142857138},{"$f":"SUM(CF16:CF23)","v":2106144.2857142859}]
[{"$f":"IF(【準備】登録!B13=\"\",\"\",【準備】登録!B13)","v":"SBC"},{"$f":"B5","v":"選手名"},null,null,{"$f":"E5","v":"持点"},{"$f":"A5","v":"NRC"},null,"W","L","TP",null,"TP",null,{"$f":"A15","v":"WRC"},null,"W","L","W","L","TP",null,"TP",null,{"$f":"A5","v":"NRC"},null,"W","L","W","L","TP",null,"TP",null,{"$f":"A15","v":"WRC"},null,"W","L","W","L","TP",null,"TP",null,{"$f":"A5","v":"NRC"},null,"W","L","W","L","TP",null,"TP",null,{"$f":"A15","v":"WRC"},null,"W","L","W","L","TP",null,"TP",null,"R",{"$f":"BM$5","v":"1G"},"2G","3G","4G","5G","6G",null,null,null,null,null,null,null,null,null,null,{"$f":"CC$5","v":"W"},{"$f":"CD$5","v":"L"},{"$f":"CE$5","v":"TP"},{"$f":"CF$5","v":"R_P"}]
[null,{"$f":"IF(【準備】登録!$D$11=0,\"\",【準備】登録!$D$13)","v":"大橋"},null,null,{"$f":"【準備】登録!F13","v":180},{"$f":"IF(【進行】結果入力表!G7=\"\",\"\",【進行】結果入力表!G7)","v":"w"},null,{"$f":"IF(F26=\"\",\"\",IF(F26=\"w\",1,0))","v":1},{"$f":"IF(F26=\"\",\"\",IF(F26=\"w\",0,1))","v":0},{"$f":"IF(F26=\"\",\"\",IF(F26=\"w\",E26,F26))","v":180},null,{"$f":"IF($F26=\"\",\"\",J26/$E26*180)","v":180},null,{"$f":"IF(【進行】結果入力表!G23=\"\",\"\",【進行】結果入力表!G23)","v":81},null,{"$f":"IF(N26=\"\",\"\",IF(N26=\"w\",1,0))","v":0},{"$f":"IF(N26=\"\",\"\",IF(N26=\"w\",0,1))","v":1},{"$f":"IF(N26=\"\",\"\",SUM(H26,P26))","v":1},{"$f":"IF(N26=\"\",\"\",SUM(I26,Q26))","v":1},{"$f":"IF(N26=\"\",\"\",IF(N26=\"w\",E26+J26,N26+J26))","v":261},null,{"$f":"IF($N26=\"\",\"\",T26/$E26*180)","v":261},null,{"$f":"IF(【進行】結果入力表!G31=\"\",\"\",【進行】結果入力表!G31)","v":"w"},null,{"$f":"IF(X26=\"\",\"\",IF(X26=\"w\",1,0))","v":1},{"$f":"IF(X26=\"\",\"\",IF(X26=\"w\",0,1))","v":0},{"$f":"IF(X26=\"\",\"\",SUM(R26,Z26))","v":2},{"$f":"IF(X26=\"\",\"\",SUM(S26,AA26))","v":1},{"$f":"IF(X26=\"\",\"\",IF(X26=\"w\",T26+E26,X26+T26))","v":441},null,{"$f":"IF($X26=\"\",\"\",AD26/$E26*180)","v":441.00000000000006},null,{"$f":"IF(【進行】結果入力表!G47=\"\",\"\",【進行】結果入力表!G47)","v":22},null,{"$f":"IF(AH26=\"\",\"\",IF(AH26=\"w\",1,0))","v":0},{"$f":"IF(AH26=\"\",\"\",IF(AH26=\"w\",0,1))","v":1},{"$f":"IF(AH26=\"\",\"\",SUM(AB26,AJ26))","v":2},{"$f":"IF(AH26=\"\",\"\",SUM(AC26,AK26))","v":2},{"$f":"IF(AH26=\"\",\"\",IF(AH26=\"w\",AD26+E26,AH26+AD26))","v":463},null,{"$f":"IF($AH26=\"\",\"\",AN26/$E26*180)","v":463.00000000000006},null,{"$f":"IF(【進行】結果入力表!G55=\"\",\"\",【進行】結果入力表!G55)","v":15},null,{"$f":"IF(AR26=\"\",\"\",IF(AR26=\"w\",1,0))","v":0},{"$f":"IF(AR26=\"\",\"\",IF(AR26=\"w\",0,1))","v":1},{"$f":"IF(AR26=\"\",\"\",IF(AR26=\"w\",AL26+1,AL26))","v":2},{"$f":"IF(AR26=\"\",\"\",IF(AR26=\"w\",AM26,AM26+1))","v":3},{"$f":"IF(AR26=\"\",\"\",IF(AR26=\"w\",AN26+E26,AR26+AN26))","v":478},null,{"$f":"IF($AR26=\"\",\"\",AX26/$E26*180)","v":478},null,{"$f":"IF(【進行】結果入力表!G71=\"\",\"\",【進行】結果入力表!G71)","v":"w"},null,{"$f":"IF(BB26=\"\",\"\",IF(BB26=\"w\",1,0))","v":1},{"$f":"IF(BB26=\"\",\"\",IF(BB26=\"w\",0,1))","v":0},{"$f":"IF(BB26=\"\",\"\",IF(BB26=\"w\",AV26+1,AV26))","v":3},{"$f":"IF(BB26=\"\",\"\",IF(BB26=\"w\",AW26,AW26+1))","v":3},{"$f":"IF(BB26=\"\",\"\",IF(BB26=\"w\",AX26+E26,BB26+AX26))","v":658},null,{"$f":"IF($BB26=\"\",\"\",BH26/$E26*180)","v":658},null,{"$f":"IF(SUM(H26:I26,R26:S26)=0,\"\",IF(B$13=\"\",RANK($CF$26:$CF$32,$CF$26:$CF$32,0),RANK($CF$26:$CF$33,$CF$26:$CF$33,0)))","v":3},{"$f":"IF(【進行】結果入力表!H7=\"\",\"\",【進行】結果入力表!H7)","v":""},{"$f":"IF(【進行】結果入力表!H23=\"\",\"\",【進行】結果入力表!H23)","v":""},{"$f":"IF(【進行】結果入力表!H31=\"\",\"\",【進行】結果入力表!H31)","v":""},{"$f":"IF(【進行】結果入力表!H47=\"\",\"\",【進行】結果入力表!H47)","v":""},{"$f":"IF(【進行】結果入力表!H55=\"\",\"\",【進行】結果入力表!H55)","v":""},{"$f":"IF(【進行】結果入力表!H71=\"\",\"\",【進行】結果入力表!H71)","v":""},null,{"$f":"COUNTIF($BM26:$BR26,BT$5)","v":0},{"$f":"COUNTIF($BM26:$BR26,BU$5)","v":0},{"$f":"MAX($BM26:$BR26)","v":0},{"$f":"BT26*10000+BU26*1000+BV26","v":0},8,{"$f":"B26","v":"大橋"},{"$f":"$A$25","v":"SBC"},{"$f":"IF(BT26>0,\"A\"&E26,IF(BU26>0,\"B\"&E26,BV26))","v":0},null,{"$f":"COUNTIF(F26:BC26,\"w\")","v":3},{"$f":"COUNT(F26,N26,AH26,X26,AR26,BB26)","v":3},{"$f":"CC26*180+SUM(F26,N26,AH26,X26,AR26,BB26)*180/E26","v":658},{"$f":"CC26*100000+CE26","v":300658}]
[null,{"$f":"IF(【準備】登録!$D$11=0,\"\",【準備】登録!$G$13)","v":"西峰"},null,null,{"$f":"【準備】登録!I13","v":180},{"$f":"IF(【進行】結果入力表!G8=\"\",\"\",【進行】結果入力表!G8)","v":83},null,{"$f":"IF(F27=\"\",\"\",IF(F27=\"w\",1,0))","v":0},{"$f":"IF(F27=\"\",\"\",IF(F27=\"w\",0,1))","v":1},{"$f":"IF(F27=\"\",\"\",IF(F27=\"w\",E27,F27))","v":83},null,{"$f":"IF($F27=\"\",\"\",J27/$E27*180)","v":83},null,{"$f":"IF(【進行】結果入力表!G24=\"\",\"\",【進行】結果入力表!G24)","v":"w"},null,{"$f":"IF(N27=\"\",\"\",IF(N27=\"w\",1,0))","v":1},{"$f":"IF(N27=\"\",\"\",IF(N27=\"w\",0,1))","v":0},{"$f":"IF(N27=\"\",\"\",SUM(H27,P27))","v":1},{"$f":"IF(N27=\"\",\"\",SUM(I27,Q27))","v":1},263,null,263,null,{"$f":"IF(【進行】結果入力表!G32=\"\",\"\",【進行】結果入力表!G32)","v":"w"},null,{"$f":"IF(X27=\"\",\"\",IF(X27=\"w\",1,0))","v":1},{"$f":"IF(X27=\"\",\"\",IF(X27=\"w\",0,1))","v":0},{"$f":"IF(X27=\"\",\"\",SUM(R27,Z27))","v":2},{"$f":"IF(X27=\"\",\"\",SUM(S27,AA27))","v":1},443,null,443,null,{"$f":"IF(【進行】結果入力表!G48=\"\",\"\",【進行】結果入力表!G48)","v":"w"},null,{"$f":"IF(AH27=\"\",\"\",IF(AH27=\"w\",1,0))","v":1},{"$f":"IF(AH27=\"\",\"\",IF(AH27=\"w\",0,1))","v":0},{"$f":"IF(AH27=\"\",\"\",SUM(AB27,AJ27))","v":3},{"$f":"IF(AH27=\"\",\"\",SUM(AC27,AK27))","v":1},623,null,623,null,{"$f":"IF(【進行】結果入力表!G56=\"\",\"\",【進行】結果入力表!G56)","v":72},null,{"$f":"IF(AR27=\"\",\"\",IF(AR27=\"w\",1,0))","v":0},{"$f":"IF(AR27=\"\",\"\",IF(AR27=\"w\",0,1))","v":1},3,2,695,null,695,null,{"$f":"IF(【進行】結果入力表!G72=\"\",\"\",【進行】結果入力表!G72)","v":150},null,{"$f":"IF(BB27=\"\",\"\",IF(BB27=\"w\",1,0))","v":0},{"$f":"IF(BB27=\"\",\"\",IF(BB27=\"w\",0,1))","v":1},3,3,845,null,845,null,2,{"$f":"IF(【進行】結果入力表!H8=\"\",\"\",【進行】結果入力表!H8)","v":""},{"$f":"IF(【進行】結果入力表!H24=\"\",\"\",【進行】結果入力表!H24)","v":""},{"$f":"IF(【進行】結果入力表!H32=\"\",\"\",【進行】結果入力表!H32)","v":""},{"$f":"IF(【進行】結果入力表!H48=\"\",\"\",【進行】結果入力表!H48)","v":""},{"$f":"IF(【進行】結果入力表!H56=\"\",\"\",【進行】結果入力表!H56)","v":""},{"$f":"IF(【進行】結果入力表!H72=\"\",\"\",【進行】結果入力表!H72)","v":""},null,{"$f":"COUNTIF($BM27:$BR27,BT$5)","v":0},0,{"$f":"MAX($BM27:$BR27)","v":0},{"$f":"BT27*10000+BU27*1000+BV27","v":0},8,{"$f":"B27","v":"西峰"},{"$f":"$A$25","v":"SBC"},0,null,3,3,845,{"$f":"CC27*100000+CE27","v":300845}]
[null,{"$f":"IF(【準備】登録!$D$11=0,\"\",【準備】登録!$J$13)","v":"林"},null,null,{"$f":"【準備】登録!L13","v":180},{"$f":"IF(【進行】結果入力表!G9=\"\",\"\",【進行】結果入力表!G9)","v":157},null,0,1,157,null,157,null,{"$f":"IF(【進行】結果入力表!G25=\"\",\"\",【進行】結果入力表!G25)","v":78},null,0,1,0,2,235,null,235,null,{"$f":"IF(【進行】結果入力表!G33=\"\",\"\",【進行】結果入力表!G33)","v":"w"},null,1,0,1,2,415,null,414.99999999999994,null,{"$f":"IF(【進行】結果入力表!G49=\"\",\"\",【進行】結果入力表!G49)","v":104},null,0,1,1,3,519,null,519,null,{"$f":"IF(【進行】結果入力表!G57=\"\",\"\",【進行】結果入力表!G57)","v":"w"},null,1,0,2,3,699,null,699,null,{"$f":"IF(【進行】結果入力表!G73=\"\",\"\",【進行】結果入力表!G73)","v":"w"},null,1,0,3,3,879,null,879.00000000000011,null,1,{"$f":"IF(【進行】結果入力表!H9=\"\",\"\",【進行】結果入力表!H9)","v":""},{"$f":"IF(【進行】結果入力表!H25=\"\",\"\",【進行】結果入力表!H25)","v":""},{"$f":"IF(【進行】結果入力表!H33=\"\",\"\",【進行】結果入力表!H33)","v":""},{"$f":"IF(【進行】結果入力表!H49=\"\",\"\",【進行】結果入力表!H49)","v":""},{"$f":"IF(【進行】結果入力表!H57=\"\",\"\",【進行】結果入力表!H57)","v":""},{"$f":"IF(【進行】結果入力表!H73=\"\",\"\",【進行】結果入力表!H73)","v":113},null,0,0,113,113,{"$f":"RANK(BW28,$BW$6:$BW$33)","v":3},"林","SBC",113,null,3,3,879,300879]
[null,{"$f":"IF(【準備】登録!$D$11=0,\"\",【準備】登録!$M$13)","v":"秋田"},null,null,{"$f":"【準備】登録!O13","v":180},{"$f":"IF(【進行】結果入力表!G10=\"\",\"\",【進行】結果入力表!G10)","v":118},null,0,1,118,null,118,null,{"$f":"IF(【進行】結果入力表!G26=\"\",\"\",【進行】結果入力表!G26)","v":73},null,0,1,0,2,191,null,191,null,{"$f":"IF(【進行】結果入力表!G34=\"\",\"\",【進行】結果入力表!G34)","v":137},null,0,1,0,3,328,null,328,null,{"$f":"IF(【進行】結果入力表!G50=\"\",\"\",【進行】結果入力表!G50)","v":151},null,0,1,0,4,479,null,479,null,{"$f":"IF(【進行】結果入力表!G58=\"\",\"\",【進行】結果入力表!G58)","v":155},null,0,1,0,5,634,null,634,null,{"$f":"IF(【進行】結果入力表!G74=\"\",\"\",【進行】結果入力表!G74)","v":"w"},null,1,0,1,5,814,null,814,null,6,{"$f":"IF(【進行】結果入力表!H10=\"\",\"\",【進行】結果入力表!H10)","v":""},{"$f":"IF(【進行】結果入力表!H26=\"\",\"\",【進行】結果入力表!H26)","v":""},{"$f":"IF(【進行】結果入力表!H34=\"\",\"\",【進行】結果入力表!H34)","v":""},{"$f":"IF(【進行】結果入力表!H50=\"\",\"\",【進行】結果入力表!H50)","v":""},{"$f":"IF(【進行】結果入力表!H58=\"\",\"\",【進行】結果入力表!H58)","v":""},{"$f":"IF(【進行】結果入力表!H74=\"\",\"\",【進行】結果入力表!H74)","v":""},null,0,0,0,0,8,"秋田","SBC",0,null,1,5,814,100814]
[null,{"$f":"IF(【準備】登録!$D$11=0,\"\",【準備】登録!$P$13)","v":"山中"},null,null,{"$f":"【準備】登録!R13","v":180},{"$f":"IF(【進行】結果入力表!G11=\"\",\"\",【進行】結果入力表!G11)","v":141},null,0,1,141,null,141,null,{"$f":"IF(【進行】結果入力表!G27=\"\",\"\",【進行】結果入力表!G27)","v":"w"},null,1,0,1,1,321,null,321,null,{"$f":"IF(【進行】結果入力表!G35=\"\",\"\",【進行】結果入力表!G35)","v":169},null,0,1,1,2,490,null,490,null,{"$f":"IF(【進行】結果入力表!G51=\"\",\"\",【進行】結果入力表!G51)","v":75},null,0,1,1,3,565,null,565,null,{"$f":"IF(【進行】結果入力表!G59=\"\",\"\",【進行】結果入力表!G59)","v":"w"},null,1,0,2,3,745,null,745.00000000000011,null,{"$f":"IF(【進行】結果入力表!G75=\"\",\"\",【進行】結果入力表!G75)","v":158},null,0,1,2,4,903,null,903,null,4,{"$f":"IF(【進行】結果入力表!H11=\"\",\"\",【進行】結果入力表!H11)","v":""},{"$f":"IF(【進行】結果入力表!H27=\"\",\"\",【進行】結果入力表!H27)","v":""},{"$f":"IF(【進行】結果入力表!H35=\"\",\"\",【進行】結果入力表!H35)","v":""},{"$f":"IF(【進行】結果入力表!H51=\"\",\"\",【進行】結果入力表!H51)","v":""},{"$f":"IF(【進行】結果入力表!H59=\"\",\"\",【進行】結果入力表!H59)","v":""},{"$f":"IF(【進行】結果入力表!H75=\"\",\"\",【進行】結果入力表!H75)","v":105},null,0,0,105,105,6,"山中","SBC",105,null,2,4,903,200903]
[null,{"$f":"IF(【準備】登録!$D$11=0,\"\",【準備】登録!$S$13)","v":"柳川"},null,null,{"$f":"【準備】登録!U13","v":180},{"$f":"IF(【進行】結果入力表!G12=\"\",\"\",【進行】結果入力表!G12)","v":164},null,0,1,164,null,164,null,{"$f":"IF(【進行】結果入力表!G28=\"\",\"\",【進行】結果入力表!G28)","v":120},null,0,1,0,2,284,null,284,null,{"$f":"IF(【進行】結果入力表!G36=\"\",\"\",【進行】結果入力表!G36)","v":57},null,0,1,0,3,341,null,341,null,{"$f":"IF(【進行】結果入力表!G52=\"\",\"\",【進行】結果入力表!G52)","v":"w"},null,1,0,1,3,521,null,521,null,{"$f":"IF(【進行】結果入力表!G60=\"\",\"\",【進行】結果入力表!G60)","v":62},null,0,1,1,4,583,null,583,null,{"$f":"IF(【進行】結果入力表!G76=\"\",\"\",【進行】結果入力表!G76)","v":95},null,0,1,1,5,678,null,678,null,7,{"$f":"IF(【進行】結果入力表!H12=\"\",\"\",【進行】結果入力表!H12)","v":""},{"$f":"IF(【進行】結果入力表!H28=\"\",\"\",【進行】結果入力表!H28)","v":""},{"$f":"IF(【進行】結果入力表!H36=\"\",\"\",【進行】結果入力表!H36)","v":""},{"$f":"IF(【進行】結果入力表!H52=\"\",\"\",【進行】結果入力表!H52)","v":""},{"$f":"IF(【進行】結果入力表!H60=\"\",\"\",【進行】結果入力表!H60)","v":""},{"$f":"IF(【進行】結果入力表!H76=\"\",\"\",【進行】結果入力表!H76)","v":""},null,0,0,0,0,8,"柳川","SBC",0,null,1,5,678,100678]
[null,{"$f":"IF(【準備】登録!$D$11=0,\"\",【準備】登録!$V$13)","v":"大橋"},null,null,{"$f":"【準備】登録!X13","v":140},{"$f":"IF(【進行】結果入力表!G13=\"\",\"\",【進行】結果入力表!G13)","v":53},null,0,1,53,null,68.142857142857139,null,{"$f":"IF(【進行】結果入力表!G29=\"\",\"\",【進行】結果入力表!G29)","v":49},null,0,1,0,2,102,null,131.14285714285714,null,{"$f":"IF(【進行】結果入力表!G37=\"\",\"\",【進行】結果入力表!G37)","v":102},null,0,1,0,3,204,null,262.28571428571428,null,{"$f":"IF(【進行】結果入力表!G53=\"\",\"\",【進行】結果入力表!G53)","v":"w"},null,1,0,1,3,344,null,442.28571428571433,null,{"$f":"IF(【進行】結果入力表!G61=\"\",\"\",【進行】結果入力表!G61)","v":52},null,0,1,1,4,396,null,509.14285714285717,null,{"$f":"IF(【進行】結果入力表!G77=\"\",\"\",【進行】結果入力表!G77)","v":"w"},null,1,0,2,4,536,null,689.14285714285722,null,5,{"$f":"IF(【進行】結果入力表!H13=\"\",\"\",【進行】結果入力表!H13)","v":""},{"$f":"IF(【進行】結果入力表!H29=\"\",\"\",【進行】結果入力表!H29)","v":""},{"$f":"IF(【進行】結果入力表!H37=\"\",\"\",【進行】結果入力表!H37)","v":""},{"$f":"IF(【進行】結果入力表!H53=\"\",\"\",【進行】結果入力表!H53)","v":""},{"$f":"IF(【進行】結果入力表!H61=\"\",\"\",【進行】結果入力表!H61)","v":""},{"$f":"IF(【進行】結果入力表!H77=\"\",\"\",【進行】結果入力表!H77)","v":""},null,0,0,0,0,8,"大橋","SBC",0,null,2,4,689.14285714285711,200689.14285714287]
[null,{"$f":"IF(【準備】登録!$Y$13=0,\"\",【準備】登録!$Y$13)","v":""},null,null,{"$f":"IF(【準備】登録!$Y$13=\"\",\"\",【準備】登録!AA13)","v":""},{"$f":"IF(【進行】結果入力表!G14=\"\",\"\",【進行】結果入力表!G14)","v":""},null,{"$f":"IF(F33=\"\",\"\",IF(F33=\"w\",1,0))","v":""},{"$f":"IF(F33=\"\",\"\",IF(F33=\"w\",0,1))","v":""},"",null,"",null,{"$f":"IF(【進行】結果入力表!G30=\"\",\"\",【進行】結果入力表!G30)","v":""},null,"","","","","",null,"",null,{"$f":"IF(【進行】結果入力表!G38=\"\",\"\",【進行】結果入力表!G38)","v":""},null,"","","","","",null,"",null,{"$f":"IF(【進行】結果入力表!G54=\"\",\"\",【進行】結果入力表!G54)","v":""},null,"","","","","",null,"",null,{"$f":"IF(【進行】結果入力表!G62=\"\",\"\",【進行】結果入力表!G62)","v":""},null,"","","","","",null,"",null,{"$f":"IF(【進行】結果入力表!G78=\"\",\"\",【進行】結果入力表!G78)","v":""},null,"","","","","",null,"",null,"",{"$f":"IF(【進行】結果入力表!I14=\"\",\"\",IF(【進行】結果入力表!H14=\"\",\"\",【進行】結果入力表!H14))","v":""},{"$f":"IF(【進行】結果入力表!I30=\"\",\"\",IF(【進行】結果入力表!H30=\"\",\"\",【進行】結果入力表!H30))","v":""},{"$f":"IF(【進行】結果入力表!I38=\"\",\"\",IF(【進行】結果入力表!H38=\"\",\"\",【進行】結果入力表!H38))","v":""},{"$f":"IF(【進行】結果入力表!I54=\"\",\"\",IF(【進行】結果入力表!H54=\"\",\"\",【進行】結果入力表!H54))","v":""},{"$f":"IF(【進行】結果入力表!I61=\"\",\"\",IF(【進行】結果入力表!H62=\"\",\"\",【進行】結果入力表!H62))","v":""},{"$f":"IF(【進行】結果入力表!I78=\"\",\"\",IF(【進行】結果入力表!H78=\"\",\"\",【進行】結果入力表!H78))","v":""},null,0,0,0,0,8,"","SBC",0,null,{"$f":"IF(B33=\"\",\"\",COUNTIF(F33:BC33,\"w\"))","v":""},{"$f":"IF(B33=\"\",\"\",COUNT(F33,N33,AH33,X33,AR33,BB33))","v":""},{"$f":"IF(CC33=\"\",\"\",CC33*180+SUM(F33,N33,AH33,X33,AR33,BB33)*180/E33)","v":""},{"$f":"IF(B33=\"\",\"\",CC33*100000+CE33)","v":""}]
[null,"Total",null,null,null,null,null,{"$f":"IF(COUNTBLANK(H26:H33)=8,\"\",SUM(H26:H33))","v":1},{"$f":"IF(COUNTBLANK(I26:I33)=8,\"\",SUM(I26:I33))","v":6},{"$f":"IF($B26=\"\",\"\",SUM(J26:J33))","v":896},{"$f":"IF($B26=\"\",\"\",SUM(K26:K33))","v":0},{"$f":"IF(COUNTBLANK(L26:L33)=8,\"\",SUM(L26:L33))","v":911.14285714285711},{"$f":"IF($B26=\"\",\"\",SUM(M26:M33))","v":0},null,null,{"$f":"SUM(P26:P33)","v":2},{"$f":"SUM(Q26:Q33)","v":5},{"$f":"IF(COUNTBLANK(R26:R33)=8,\"\",SUM(H34,P34))","v":3},{"$f":"IF(COUNTBLANK(S26:S33)=8,\"\",SUM(I34,Q34))","v":11},{"$f":"IF($B26=\"\",\"\",SUM(T26:T33))","v":1657},{"$f":"IF($B26=\"\",\"\",SUM(U26:U33))","v":0},{"$f":"IF(COUNTBLANK(V26:V33)=8,\"\",SUM(V26:V33))","v":1686.1428571428571},{"$f":"IF($B26=\"\",\"\",SUM(W26:W33))","v":0},null,null,{"$f":"SUM(Z26:Z33)","v":3},{"$f":"SUM(AA26:AA33)","v":4},{"$f":"IF(COUNTBLANK(AB26:AB33)=8,\"\",SUM(R34,Z34))","v":6},{"$f":"IF(COUNTBLANK(AC26:AC33)=8,\"\",SUM(S34,AA34))","v":15},{"$f":"IF($B26=\"\",\"\",SUM(AD26:AD33))","v":2662},{"$f":"IF($B26=\"\",\"\",SUM(AE26:AE33))","v":0},{"$f":"IF(COUNTBLANK(AF26:AF33)=8,\"\",SUM(AF26:AF33))","v":2720.2857142857142},{"$f":"IF($B26=\"\",\"\",SUM(AG26:AG33))","v":0},null,null,{"$f":"SUM(AJ26:AJ33)","v":3},{"$f":"SUM(AK26:AK33)","v":4},{"$f":"IF(COUNTBLANK(AL26:AL33)=8,\"\",SUM(AB34,AJ34))","v":9},{"$f":"IF(COUNTBLANK(AM26:AM33)=8,\"\",SUM(AC34,AK34))","v":19},{"$f":"IF($B26=\"\",\"\",SUM(AN26:AN33))","v":3514},{"$f":"IF($B26=\"\",\"\",SUM(AO26:AO33))","v":0},{"$f":"IF(COUNTBLANK(AP26:AP33)=8,\"\",SUM(AP26:AP33))","v":3612.2857142857142},{"$f":"IF($B26=\"\",\"\",SUM(AQ26:AQ33))","v":0},null,null,{"$f":"SUM(AT26:AT33)","v":2},{"$f":"SUM(AU26:AU33)","v":5},{"$f":"IF(COUNTBLANK(AV26:AV33)=8,\"\",SUM(AL34,AT34))","v":11},{"$f":"IF(COUNTBLANK(AW26:AW33)=8,\"\",SUM(AM34,AU34))","v":24},{"$f":"IF($B26=\"\",\"\",SUM(AX26:AX33))","v":4230},{"$f":"IF($B26=\"\",\"\",SUM(AY26:AY33))","v":0},{"$f":"IF(COUNTBLANK(AZ26:AZ33)=8,\"\",SUM(AZ26:AZ33))","v":4343.1428571428569},{"$f":"IF($B26=\"\",\"\",SUM(BA26:BA33))","v":0},null,null,{"$f":"SUM(BD26:BD33)","v":4},{"$f":"SUM(BE26:BE33)","v":3},{"$f":"IF(COUNTBLANK(BF26:BF33)=8,\"\",SUM(AV34,BD34))","v":15},{"$f":"IF(COUNTBLANK(BG26:BG33)=8,\"\",SUM(AW34,BE34))","v":27},{"$f":"IF(COUNTIF(BH26:BI33,\"\")=16,\"\",SUM(BH26:BH33))","v":5313},{"$f":"IF($B26=\"\",\"\",SUM(BI26:BI33))","v":0},{"$f":"IF(COUNTBLANK(BJ26:BJ33)=8,\"\",SUM(BJ26:BJ33))","v":5466.1428571428569},{"$f":"IF($B26=\"\",\"\",SUM(BK26:BK33))","v":0},null,null,null,null,null,null,null,null,null,null,null,null,null,null,null,null,null,{"$f":"SUM(CC26:CC33)","v":15},{"$f":"SUM(CD26:CD33)","v":27},{"$f":"SUM(CE26:CE33)","v":5466.1428571428569},{"$f":"SUM(CF26:CF33)","v":1505466.142857143}]
[null,"※","TPの数字は、ハンデによる換算後の得点を示す。"]

{"sheet":"【結果】リーグ成績表","index":4,"n_rows":43,"n_cols":59,"rows_kept":43,"cut":false,"hidden":false,"merged":[[2,0,2,18],[2,20,2,38],[2,40,2,58],[41,49,41,50],[41,53,41,54],[40,40,40,41],[40,42,40,43],[41,40,41,41],[41,42,41,43],[38,53,38,54],[35,53,35,54],[35,45,35,46],[40,53,40,54],[41,47,41,48],[40,45,40,46],[40,47,40,48],[41,45,41,46],[40,49,40,50],[38,40,38,41],[38,42,38,43],[38,45,38,46],[39,40,39,41],[39,42,39,43],[39,45,39,46],[1,51,1,58],[38,47,38,48],[33,53,33,54],[34,49,34,50],[34,53,34,54],[36,53,36,54],[29,47,29,48],[36,49,36,50],[39,53,39,54],[39,47,39,48],[35,49,35,50],[39,49,39,50],[38,49,38,50],[31,53,31,54],[30,53,30,54],[28,53,28,54],[29,53,29,54],[24,53,24,54],[26,49,26,50],[26,53,26,54],[25,49,25,50],[25,53,25,54],[23,53,23,54],[24,49,24,50],[33,40,33,41],[33,42,33,43],[36,40,36,41],[36,42,36,43],[36,45,36,46],[36,47,36,48],[35,40,35,41],[35,42,35,43],[35,47,35,48],[34,40,34,41],[34,42,34,43],[34,45,34,46],[34,47,34,48],[31,40,31,41],[31,42,31,43],[31,45,31,46],[30,47,30,48],[28,40,28,41],[28,42,28,43],[31,49,31,50],[29,40,29,41],[29,42,29,43],[29,45,29,46],[30,40,30,41],[30,42,30,43],[30,45,30,46],[31,47,31,48],[29,49,29,50],[30,49,30,50],[25,40,25,41],[25,42,25,43],[26,40,26,41],[26,42,26,43],[26,45,26,46],[26,47,26,48],[25,45,25,46],[25,47,25,48],[23,40,23,41],[23,42,23,43],[24,40,24,41],[24,42,24,43],[24,45,24,46],[24,47,24,48],[18,53,18,54],[19,49,19,50],[19,53,19,54],[21,49,21,50],[21,53,21,54],[20,53,20,54],[20,49,20,50],[16,40,16,41],[16,42,16,43],[21,40,21,41],[21,42,21,43],[21,45,21,46],[21,47,21,48],[20,40,20,41],[20,42,20,43],[20,45,20,46],[20,47,20,48],[19,40,19,41],[19,42,19,43],[19,45,19,46],[19,47,19,48],[18,40,18,41],[18,42,18,43],[16,49,16,50],[16,53,16,54],[16,45,16,46],[16,47,16,48],[15,49,15,50],[15,53,15,54],[15,45,15,46],[15,47,15,48],[13,53,13,54],[14,49,14,50],[14,53,14,54],[15,40,15,41],[15,42,15,43],[11,40,11,41],[11,42,11,43],[11,45,11,46],[11,47,11,48],[14,45,14,46],[14,47,14,48],[13,40,13,41],[13,42,13,43],[14,40,14,41],[14,42,14,43],[11,49,11,50],[11,53,11,54],[10,53,10,54],[9,47,9,48],[8,53,8,54],[9,49,9,50],[9,53,9,54],[8,40,8,41],[8,42,8,43],[10,49,10,50],[10,40,10,41],[10,42,10,43],[10,45,10,46],[10,47,10,48],[9,40,9,41],[9,42,9,43],[9,45,9,46],[6,49,6,50],[6,53,6,54],[5,40,5,41],[5,42,5,43],[6,40,6,41],[6,42,6,43],[6,45,6,46],[6,47,6,48],[5,45,5,46],[5,47,5,48],[3,40,3,41],[3,42,3,43],[5,49,5,50],[5,53,5,54],[4,40,4,41],[4,42,4,43],[4,45,4,46],[4,47,4,48],[3,53,3,54],[4,49,4,50],[4,53,4,54],[38,25,38,26],[40,33,40,34],[40,20,40,21],[40,22,40,23],[40,25,40,26],[40,27,40,28],[38,20,38,21],[39,20,39,21],[39,22,39,23],[39,25,39,26],[39,27,39,28],[31,25,31,26],[41,20,41,21],[41,22,41,23],[41,25,41,26],[41,27,41,28],[38,27,38,28],[34,33,34,34],[36,29,36,30],[36,33,36,34],[41,29,41,30],[41,33,41,34],[38,33,38,34],[39,29,39,30],[39,33,39,34],[40,29,40,30],[35,20,35,21],[35,22,35,23],[38,29,38,30],[36,20,36,21],[36,22,36,23],[36,25,36,26],[36,27,36,28],[35,25,35,26],[38,22,38,23],[33,20,33,21],[33,22,33,23],[35,27,35,28],[31,27,31,28],[30,33,30,34],[29,27,29,28],[28,33,28,34],[29,29,29,30],[29,33,29,34],[29,20,29,21],[29,22,29,23],[29,25,29,26],[35,29,35,30],[35,33,35,34],[34,20,34,21],[34,22,34,23],[34,25,34,26],[34,27,34,28],[31,29,31,30],[33,33,33,34],[34,29,34,30],[31,33,31,34],[31,20,31,21],[31,22,31,23],[30,25,30,26],[30,27,30,28],[30,29,30,30],[25,20,25,21],[25,22,25,23],[25,27,25,28],[26,20,26,21],[28,20,28,21],[28,22,28,23],[30,20,30,21],[30,22,30,23],[26,22,26,23],[26,25,26,26],[23,33,23,34],[24,29,24,30],[26,27,26,28],[25,29,25,30],[25,33,25,34],[26,29,26,30],[26,33,26,34],[21,20,21,21],[21,22,21,23],[21,25,21,26],[21,27,21,28],[23,20,23,21],[23,22,23,23],[24,20,24,21],[24,22,24,23],[24,25,24,26],[24,27,24,28],[25,25,25,26],[24,33,24,34],[19,29,19,30],[19,33,19,34],[21,29,21,30],[21,33,21,34],[20,33,20,34],[20,29,20,30],[20,20,20,21],[20,22,20,23],[20,25,20,26],[20,27,20,28],[19,20,19,21],[19,22,19,23],[19,25,19,26],[19,27,19,28],[14,25,14,26],[14,27,14,28],[15,27,15,28],[13,33,13,34],[14,29,14,30],[14,33,14,34],[15,25,15,26],[18,22,18,23],[15,20,15,21],[15,22,15,23],[16,20,16,21],[16,22,16,23],[16,29,16,30],[16,33,16,34],[13,20,13,21],[13,22,13,23],[15,29,15,30],[15,33,15,34],[14,20,14,21],[14,22,14,23],[16,25,16,26],[16,27,16,28],[18,33,18,34],[18,20,18,21],[11,29,11,30],[11,33,11,34],[10,33,10,34],[9,27,9,28],[9,33,9,34],[8,20,8,21],[8,22,8,23],[10,29,10,30],[10,20,10,21],[10,22,10,23],[10,25,10,26],[10,27,10,28],[9,22,9,23],[9,25,9,26],[11,20,11,21],[11,22,11,23],[11,25,11,26],[11,27,11,28],[4,33,4,34],[6,29,6,30],[6,33,6,34],[5,20,5,21],[5,22,5,23],[6,20,6,21],[6,22,6,23],[8,33,8,34],[9,29,9,30],[5,27,5,28],[3,33,3,34],[4,29,4,30],[6,25,6,26],[6,27,6,28],[5,25,5,26],[3,20,3,21],[3,22,3,23],[5,29,5,30],[41,5,41,6],[41,7,41,8],[40,5,40,6],[40,7,40,8],[5,33,5,34],[4,20,4,21],[4,22,4,23],[4,25,4,26],[4,27,4,28],[9,20,9,21],[38,9,38,10],[38,13,38,14],[39,9,39,10],[39,13,39,14],[40,9,40,10],[40,13,40,14],[41,9,41,10],[41,13,41,14],[39,0,39,1],[39,2,39,3],[39,5,39,6],[39,7,39,8],[40,0,40,1],[40,2,40,3],[41,0,41,1],[41,2,41,3],[38,0,38,1],[38,2,38,3],[38,5,38,6],[38,7,38,8],[33,13,33,14],[34,9,34,10],[34,13,34,14],[36,9,36,10],[36,13,36,14],[35,13,35,14],[35,9,35,10],[36,0,36,1],[36,2,36,3],[36,5,36,6],[36,7,36,8],[35,0,35,1],[35,2,35,3],[35,5,35,6],[35,7,35,8],[34,0,34,1],[34,2,34,3],[34,5,34,6],[34,7,34,8],[33,0,33,1],[33,2,33,3],[31,0,31,1],[31,2,31,3],[31,9,31,10],[31,13,31,14],[31,5,31,6],[31,7,31,8],[30,9,30,10],[30,13,30,14],[29,0,29,1],[29,2,29,3],[30,7,30,8],[28,13,28,14],[30,5,30,6],[30,0,30,1],[30,2,30,3],[26,0,26,1],[26,2,26,3],[26,5,26,6],[26,7,26,8],[29,9,29,10],[29,13,29,14],[28,0,28,1],[28,2,28,3],[23,13,23,14],[24,9,24,10],[24,13,24,14],[29,5,29,6],[29,7,29,8],[26,9,26,10],[26,13,26,14],[25,13,25,14],[24,7,24,8],[23,0,23,1],[23,2,23,3],[25,9,25,10],[25,0,25,1],[25,2,25,3],[25,5,25,6],[25,7,25,8],[24,0,24,1],[24,2,24,3],[24,5,24,6],[21,0,21,1],[21,2,21,3],[21,5,21,6],[21,7,21,8],[18,13,18,14],[19,9,19,10],[19,13,19,14],[21,9,21,10],[21,13,21,14],[20,13,20,14],[20,7,20,8],[19,0,19,1],[19,2,19,3],[19,5,19,6],[19,7,19,8],[18,0,18,1],[18,2,18,3],[20,9,20,10],[16,0,16,1],[16,2,16,3],[16,5,16,6],[16,7,16,8],[20,0,20,1],[20,2,20,3],[20,5,20,6],[15,0,15,1],[15,2,15,3],[11,5,11,6],[11,7,11,8],[10,9,10,10],[10,13,10,14],[16,13,16,14],[15,13,15,14],[14,7,14,8],[13,13,13,14],[14,9,14,10],[14,13,14,14],[11,9,11,10],[15,5,15,6],[15,7,15,8],[15,9,15,10],[16,9,16,10],[8,13,8,14],[6,5,6,6],[6,7,6,8],[6,9,6,10],[8,0,8,1],[8,2,8,3],[14,0,14,1],[14,2,14,3],[14,5,14,6],[11,0,11,1],[11,2,11,3],[9,5,9,6],[9,7,9,8],[10,7,10,8],[9,13,9,14],[13,0,13,1],[13,2,13,3],[11,13,11,14],[10,0,10,1],[10,2,10,3],[10,5,10,6],[9,9,9,10],[9,0,9,1],[9,2,9,3],[3,13,3,14],[4,13,4,14],[5,13,5,14],[6,0,6,1],[3,2,3,3],[4,2,4,3],[5,2,5,3],[6,2,6,3],[3,0,3,1],[4,0,4,1],[4,5,4,6],[4,7,4,8],[4,9,4,10],[6,13,6,14],[5,5,5,6],[5,7,5,8],[5,9,5,10],[5,0,5,1]]}
[{"$f":"【結果】個人成績表!A1","v":"第16回　和奈滋対抗戦　　　(奈良；キングスポット)"}]
[null,null,null,null,null,null,null,null,null,null,null,null,null,null,null,null,null,null,null,null,null,null,null,null,null,null,null,null,null,null,null,null,null,null,null,null,null,null,null,null,null,null,null,null,null,null,null,null,null,null,null,{"$f":"【準備】登録!D4","v":"2018-11-18"}]
["第１節",null,null,null,null,null,null,null,null,null,null,null,null,null,null,null,null,null,null,null,"第２節",null,null,null,null,null,null,null,null,null,null,null,null,null,null,null,null,null,null,null,"第３節"]
[{"$f":"【準備】登録!D9","v":1},null,"Name",null,"持点",{"$f":"$A$5","v":"NRC"},null,{"$f":"$A$6","v":"WRC"},null,{"$f":"$A$7","v":"SBC"},null,"W","L","TP",null,"TP","LP","R_P","R",null,1,null,"Name",null,{"$f":"$E$4","v":"持点"},{"$f":"$A$5","v":"NRC"},null,{"$f":"$A$6","v":"WRC"},null,{"$f":"$A$7","v":"SBC"},null,"W","L","TP",null,"TP","LP","R_P","R",null,1,null,"Name",null,{"$f":"$E$4","v":"持点"},{"$f":"$A$5","v":"NRC"},null,{"$f":"$A$6","v":"WRC"},null,{"$f":"$A$7","v":"SBC"},null,"W","L","TP",null,"TP","LP","R_P","R"]
[{"$f":"IF(【準備】登録!$B$11=\"\",\"\",【準備】登録!$B$11)","v":"NRC"},null,{"$f":"【進行】結果入力表!D7","v":"斉藤"},null,{"$f":"【準備】登録!F11","v":180},null,null,{"$f":"IF(【進行】結果入力表!F15=\"\",\"\",【進行】結果入力表!F15)","v":5},null,{"$f":"IF(【進行】結果入力表!F7=\"\",\"\",【進行】結果入力表!F7)","v":62},null,{"$f":"IF(J5=\"\",\"\",COUNTIF(F5:K5,\"w\"))","v":0},{"$f":"IF(J5=\"\",\"\",COUNT(H5,J5))","v":2},{"$f":"SUM(F5:K5)+L5*E5","v":67},null,{"$f":"IF(J5=\"\",\"\",N5/E5*180)","v":67},{"$f":"IF(F6=\"w\",180,F6/E5*180)+IF(F7=\"w\",180,F7/E5*180)","v":360},{"$f":"L5*10000000+P5*L10004*10000000+P5*1000-Q5","v":66640},{"$f":"IF(J5=\"\",\"\",RANK(R5:R7,R5:R7,0))","v":3},null,{"$f":"$A$5","v":"NRC"},null,{"$f":"【進行】結果入力表!D39","v":"岩本"},null,{"$f":"【準備】登録!U11","v":180},null,null,{"$f":"IF(【進行】結果入力表!F39=\"\",\"\",【進行】結果入力表!F39)","v":132},null,{"$f":"IF(【進行】結果入力表!F31=\"\",\"\",【進行】結果入力表!F31)","v":48},null,{"$f":"IF(AD5=\"\",\"\",COUNTIF(Z5:AE5,\"w\"))","v":0},{"$f":"IF(AD5=\"\",\"\",COUNT(AB5,AD5))","v":2},{"$f":"SUM(Z5:AE5)+AF5*Y5","v":180},null,{"$f":"IF(AD5=\"\",\"\",AH5/Y5*180)","v":180},{"$f":"IF(Z6=\"w\",180,Z6/Y5*180)+IF(Z7=\"w\",180,Z7/Y5*180)","v":360},{"$f":"AF5*10000000+AJ5*AF10004*10000000+AJ5*1000-AK5","v":179640},{"$f":"IF(AD5=\"\",\"\",RANK(AL5:AL7,AL5:AL7,0))","v":3},null,{"$f":"$A$5","v":"NRC"},null,{"$f":"【進行】結果入力表!D63","v":"白戸"},null,{"$f":"【準備】登録!O11","v":180},null,null,{"$f":"IF(【進行】結果入力表!F63=\"\",\"\",【進行】結果入力表!F63)","v":117},null,{"$f":"IF(【進行】結果入力表!F55=\"\",\"\",【進行】結果入力表!F55)","v":"w"},null,{"$f":"IF(AX5=\"\",\"\",COUNTIF(AT5:AY5,\"w\"))","v":1},{"$f":"IF(AX5=\"\",\"\",COUNT(AV5,AX5))","v":1},{"$f":"SUM(AT5:AY5)+AZ5*AS5","v":297},null,{"$f":"IF(AX5=\"\",\"\",BB5/AS5*180)","v":297},{"$f":"IF(AT6=\"w\",180,AT6/AS5*180)+IF(AT7=\"w\",180,AT7/AS5*180)","v":195},{"$f":"AZ5*10000000+BD5*AZ10004*10000000+BD5*1000-BE5","v":10296805},{"$f":"IF(AX5=\"\",\"\",RANK(BF5:BF7,BF5:BF7,0))","v":2}]
[{"$f":"IF(【準備】登録!$B$12=\"\",\"\",【準備】登録!$B$12)","v":"WRC"},null,{"$f":"【進行】結果入力表!I15","v":"和田"},null,{"$f":"【準備】登録!F12","v":180},{"$f":"IF(【進行】結果入力表!G15=\"\",\"\",【進行】結果入力表!G15)","v":"w"},null,null,null,{"$f":"IF(【進行】結果入力表!F23=\"\",\"\",【進行】結果入力表!F23)","v":"w"},null,{"$f":"IF(J5=\"\",\"\",COUNTIF(F6:K6,\"w\"))","v":2},{"$f":"IF(J5=\"\",\"\",COUNT(F6,J6))","v":0},{"$f":"SUM(F6:K6)+L6*E6","v":360},null,{"$f":"IF(J5=\"\",\"\",N6/E6*180)","v":360},{"$f":"IF(H5=\"w\",180,H5/E6*180)+IF(H7=\"w\",180,H7/E6*180)","v":86},{"$f":"L6*10000000+P6*L10005*10000000+P6*1000-Q6","v":20359914},{"$f":"IF(J5=\"\",\"\",RANK(R5:R7,R5:R7,0))","v":1},null,{"$f":"$A$6","v":"WRC"},null,{"$f":"【進行】結果入力表!I39","v":"松房"},null,{"$f":"【準備】登録!X12","v":140},{"$f":"IF(【進行】結果入力表!G39=\"\",\"\",【進行】結果入力表!G39)","v":"w"},null,null,null,{"$f":"IF(【進行】結果入力表!F47=\"\",\"\",【進行】結果入力表!F47)","v":"w"},null,{"$f":"IF(AD5=\"\",\"\",COUNTIF(Z6:AE6,\"w\"))","v":2},{"$f":"IF(AD5=\"\",\"\",COUNT(Z6,AD6))","v":0},{"$f":"SUM(Z6:AE6)+AF6*Y6","v":280},null,{"$f":"IF(AD5=\"\",\"\",AH6/Y6*180)","v":360},{"$f":"IF(AB5=\"w\",180,AB5/Y6*180)+IF(AB7=\"w\",180,AB7/Y6*180)","v":198},{"$f":"AF6*10000000+AJ6*AF10005*10000000+AJ6*1000-AK6","v":20359802},{"$f":"IF(AD5=\"\",\"\",RANK(AL5:AL7,AL5:AL7,0))","v":1},null,{"$f":"$A$6","v":"WRC"},null,{"$f":"【進行】結果入力表!I63","v":"中本"},null,{"$f":"【準備】登録!U12","v":180},{"$f":"IF(【進行】結果入力表!G63=\"\",\"\",【進行】結果入力表!G63)","v":"w"},null,null,null,{"$f":"IF(【進行】結果入力表!F71=\"\",\"\",【進行】結果入力表!F71)","v":131},null,{"$f":"IF(AX5=\"\",\"\",COUNTIF(AT6:AY6,\"w\"))","v":1},{"$f":"IF(AX5=\"\",\"\",COUNT(AT6,AX6))","v":1},{"$f":"SUM(AT6:AY6)+AZ6*AS6","v":311},null,{"$f":"IF(AX5=\"\",\"\",BB6/AS6*180)","v":311},{"$f":"IF(AV5=\"w\",180,AV5/AS6*180)+IF(AV7=\"w\",180,AV7/AS6*180)","v":297},{"$f":"AZ6*10000000+BD6*AZ10005*10000000+BD6*1000-BE6","v":10310703},{"$f":"IF(AX5=\"\",\"\",RANK(BF5:BF7,BF5:BF7,0))","v":1}]
[{"$f":"IF(【準備】登録!$B$13=\"\",\"\",【準備】登録!$B$13)","v":"SBC"},null,{"$f":"【進行】結果入力表!I7","v":"大橋"},null,{"$f":"【準備】登録!F13","v":180},{"$f":"IF(【進行】結果入力表!G7=\"\",\"\",【進行】結果入力表!G7)","v":"w"},null,{"$f":"IF(【進行】結果入力表!G23=\"\",\"\",【進行】結果入力表!G23)","v":81},null,null,null,{"$f":"IF(J5=\"\",\"\",COUNTIF(F7:K7,\"w\"))","v":1},{"$f":"IF(J5=\"\",\"\",COUNT(F7,H7))","v":1},{"$f":"SUM(F7:K7)+L7*E7","v":261},null,{"$f":"IF(J5=\"\",\"\",N7/E7*180)","v":261},{"$f":"IF(J5=\"w\",180,J5/E7*180)+IF(J6=\"w\",180,J6/E7*180)","v":242},{"$f":"L7*10000000+P7*L10006*10000000+P7*1000-Q7","v":10260758},{"$f":"IF(J5=\"\",\"\",RANK(R5:R7,R5:R7,0))","v":2},null,{"$f":"$A$7","v":"SBC"},null,{"$f":"【進行】結果入力表!I31","v":"大橋"},null,{"$f":"【準備】登録!F13","v":180},{"$f":"IF(【進行】結果入力表!G31=\"\",\"\",【進行】結果入力表!G31)","v":"w"},null,{"$f":"IF(【進行】結果入力表!G47=\"\",\"\",【進行】結果入力表!G47)","v":22},null,null,null,{"$f":"IF(AD5=\"\",\"\",COUNTIF(Z7:AE7,\"w\"))","v":1},{"$f":"IF(AD5=\"\",\"\",COUNT(Z7,AB7))","v":1},{"$f":"SUM(Z7:AE7)+AF7*Y7","v":202},null,{"$f":"IF(AD5=\"\",\"\",AH7/Y7*180)","v":202},{"$f":"IF(AD5=\"w\",180,AD5/Y7*180)+IF(AD6=\"w\",180,AD6/Y7*180)","v":228},{"$f":"AF7*10000000+AJ7*AF10006*10000000+AJ7*1000-AK7","v":10201772},{"$f":"IF(AD5=\"\",\"\",RANK(AL5:AL7,AL5:AL7,0))","v":2},null,{"$f":"$A$7","v":"SBC"},null,{"$f":"【進行】結果入力表!I55","v":"大橋"},null,{"$f":"【準備】登録!F13","v":180},{"$f":"IF(【進行】結果入力表!G55=\"\",\"\",【進行】結果入力表!G55)","v":15},null,{"$f":"IF(【進行】結果入力表!G71=\"\",\"\",【進行】結果入力表!G71)","v":"w"},null,null,null,{"$f":"IF(AX5=\"\",\"\",COUNTIF(AT7:AY7,\"w\"))","v":1},{"$f":"IF(AX5=\"\",\"\",COUNT(AT7,AV7))","v":1},{"$f":"SUM(AT7:AY7)+AZ7*AS7","v":195},null,{"$f":"IF(AX5=\"\",\"\",BB7/AS7*180)","v":195},{"$f":"IF(AX5=\"w\",180,AX5/AS7*180)+IF(AX6=\"w\",180,AX6/AS7*180)","v":311},{"$f":"AZ7*10000000+BD7*AZ10006*10000000+BD7*1000-BE7","v":10194689},{"$f":"IF(AX5=\"\",\"\",RANK(BF5:BF7,BF5:BF7,0))","v":3}]
[]
[2,null,"Name",null,{"$f":"$E$4","v":"持点"},{"$f":"$A$5","v":"NRC"},null,{"$f":"$A$6","v":"WRC"},null,{"$f":"$A$7","v":"SBC"},null,"W","L","TP",null,"TP","LP","R_P","R",null,2,null,"Name",null,{"$f":"$E$4","v":"持点"},{"$f":"$A$5","v":"NRC"},null,{"$f":"$A$6","v":"WRC"},null,{"$f":"$A$7","v":"SBC"},null,"W","L","TP",null,"TP","LP","R_P","R",null,2,null,"Name",null,{"$f":"$E$4","v":"持点"},{"$f":"$A$5","v":"NRC"},null,{"$f":"$A$6","v":"WRC"},null,{"$f":"$A$7","v":"SBC"},null,"W","L","TP",null,"TP","LP","R_P","R"]
[{"$f":"$A$5","v":"NRC"},null,{"$f":"【進行】結果入力表!D8","v":"山田"},null,{"$f":"【準備】登録!I11","v":180},null,null,{"$f":"IF(【進行】結果入力表!F16=\"\",\"\",【進行】結果入力表!F16)","v":"w"},null,{"$f":"IF(【進行】結果入力表!F8=\"\",\"\",【進行】結果入力表!F8)","v":"w"},null,{"$f":"IF(J10=\"\",\"\",COUNTIF(F10:K10,\"w\"))","v":2},{"$f":"IF(J10=\"\",\"\",COUNT(H10,J10))","v":0},{"$f":"SUM(F10:K10)+L10*E10","v":360},null,{"$f":"IF(J10=\"\",\"\",N10/E10*180)","v":360},{"$f":"IF(F11=\"w\",180,F11/E10*180)+IF(F12=\"w\",180,F12/E10*180)","v":217},{"$f":"L10*10000000+P10*L10009*10000000+P10*1000-Q10","v":20359783},{"$f":"IF(J10=\"\",\"\",RANK(R10:R12,R10:R12,0))","v":1},null,{"$f":"$A$5","v":"NRC"},null,{"$f":"【進行】結果入力表!D40","v":"白戸"},null,{"$f":"【準備】登録!X11","v":140},null,null,{"$f":"IF(【進行】結果入力表!F40=\"\",\"\",【進行】結果入力表!F40)","v":120},null,{"$f":"IF(【進行】結果入力表!F32=\"\",\"\",【進行】結果入力表!F32)","v":96},null,{"$f":"IF(AD10=\"\",\"\",COUNTIF(Z10:AE10,\"w\"))","v":0},{"$f":"IF(AD10=\"\",\"\",COUNT(AB10,AD10))","v":2},{"$f":"SUM(Z10:AE10)+AF10*Y10","v":216},null,{"$f":"IF(AD10=\"\",\"\",AH10/Y10*180)","v":277.71428571428572},{"$f":"IF(Z11=\"w\",180,Z11/Y10*180)+IF(Z12=\"w\",180,Z12/Y10*180)","v":360},{"$f":"AF10*10000000+AJ10*AF10009*10000000+AJ10*1000-AK10","v":277354.28571428574},{"$f":"IF(AD10=\"\",\"\",RANK(AL10:AL12,AL10:AL12,0))","v":3},null,{"$f":"$A$5","v":"NRC"},null,{"$f":"【進行】結果入力表!D64","v":"植田"},null,{"$f":"【準備】登録!R11","v":180},null,null,{"$f":"IF(【進行】結果入力表!F64=\"\",\"\",【進行】結果入力表!F64)","v":84},null,{"$f":"IF(【進行】結果入力表!F56=\"\",\"\",【進行】結果入力表!F56)","v":"w"},null,{"$f":"IF(AX10=\"\",\"\",COUNTIF(AT10:AY10,\"w\"))","v":1},{"$f":"IF(AX10=\"\",\"\",COUNT(AV10,AX10))","v":1},{"$f":"SUM(AT10:AY10)+AZ10*AS10","v":264},null,{"$f":"IF(AX10=\"\",\"\",BB10/AS10*180)","v":264},{"$f":"IF(AT11=\"w\",180,AT11/AS10*180)+IF(AT12=\"w\",180,AT12/AS10*180)","v":252},{"$f":"AZ10*10000000+BD10*AZ10009*10000000+BD10*1000-BE10","v":10263748},{"$f":"IF(AX10=\"\",\"\",RANK(BF10:BF12,BF10:BF12,0))","v":2}]
[{"$f":"$A$6","v":"WRC"},null,{"$f":"【進行】結果入力表!I16","v":"山中"},null,{"$f":"【準備】登録!I12","v":180},{"$f":"IF(【進行】結果入力表!G16=\"\",\"\",【進行】結果入力表!G16)","v":134},null,null,null,{"$f":"IF(【進行】結果入力表!F24=\"\",\"\",【進行】結果入力表!F24)","v":159},null,{"$f":"IF(J10=\"\",\"\",COUNTIF(F11:K11,\"w\"))","v":0},{"$f":"IF(J10=\"\",\"\",COUNT(F11,J11))","v":2},{"$f":"SUM(F11:K11)+L11*E11","v":293},null,{"$f":"IF(J10=\"\",\"\",N11/E11*180)","v":293},{"$f":"IF(H10=\"w\",180,H10/E11*180)+IF(H12=\"w\",180,H12/E11*180)","v":360},{"$f":"L11*10000000+P11*L10010*10000000+P11*1000-Q11","v":292640},{"$f":"IF(J10=\"\",\"\",RANK(R10:R12,R10:R12,0))","v":3},null,{"$f":"$A$6","v":"WRC"},null,{"$f":"【進行】結果入力表!I40","v":"和田"},null,{"$f":"【準備】登録!F12","v":180},{"$f":"IF(【進行】結果入力表!G40=\"\",\"\",【進行】結果入力表!G40)","v":"w"},null,null,null,{"$f":"IF(【進行】結果入力表!F48=\"\",\"\",【進行】結果入力表!F48)","v":98},null,{"$f":"IF(AD10=\"\",\"\",COUNTIF(Z11:AE11,\"w\"))","v":1},{"$f":"IF(AD10=\"\",\"\",COUNT(Z11,AD11))","v":1},{"$f":"SUM(Z11:AE11)+AF11*Y11","v":278},null,{"$f":"IF(AD10=\"\",\"\",AH11/Y11*180)","v":278},{"$f":"IF(AB10=\"w\",180,AB10/Y11*180)+IF(AB12=\"w\",180,AB12/Y11*180)","v":300},{"$f":"AF11*10000000+AJ11*AF10010*10000000+AJ11*1000-AK11","v":10277700},{"$f":"IF(AD10=\"\",\"\",RANK(AL10:AL12,AL10:AL12,0))","v":2},null,{"$f":"$A$6","v":"WRC"},null,{"$f":"【進行】結果入力表!I64","v":"松房"},null,{"$f":"【準備】登録!X12","v":140},{"$f":"IF(【進行】結果入力表!G64=\"\",\"\",【進行】結果入力表!G64)","v":"w"},null,null,null,{"$f":"IF(【進行】結果入力表!F72=\"\",\"\",【進行】結果入力表!F72)","v":"w"},null,{"$f":"IF(AX10=\"\",\"\",COUNTIF(AT11:AY11,\"w\"))","v":2},{"$f":"IF(AX10=\"\",\"\",COUNT(AT11,AX11))","v":0},{"$f":"SUM(AT11:AY11)+AZ11*AS11","v":280},null,{"$f":"IF(AX10=\"\",\"\",BB11/AS11*180)","v":360},{"$f":"IF(AV10=\"w\",180,AV10/AS11*180)+IF(AV12=\"w\",180,AV12/AS11*180)","v":300.85714285714289},{"$f":"AZ11*10000000+BD11*AZ10010*10000000+BD11*1000-BE11","v":20359699.142857142},{"$f":"IF(AX10=\"\",\"\",RANK(BF10:BF12,BF10:BF12,0))","v":1}]
[{"$f":"$A$7","v":"SBC"},null,{"$f":"【進行】結果入力表!I8","v":"西峰"},null,{"$f":"【準備】登録!I13","v":180},{"$f":"IF(【進行】結果入力表!G8=\"\",\"\",【進行】結果入力表!G8)","v":83},null,{"$f":"IF(【進行】結果入力表!G24=\"\",\"\",【進行】結果入力表!G24)","v":"w"},null,null,null,{"$f":"IF(J10=\"\",\"\",COUNTIF(F12:K12,\"w\"))","v":1},{"$f":"IF(J10=\"\",\"\",COUNT(F12,H12))","v":1},{"$f":"SUM(F12:K12)+L12*E12","v":263},null,{"$f":"IF(J10=\"\",\"\",N12/E12*180)","v":263},{"$f":"IF(J10=\"w\",180,J10/E12*180)+IF(J11=\"w\",180,J11/E12*180)","v":339},{"$f":"L12*10000000+P12*L10011*10000000+P12*1000-Q12","v":10262661},{"$f":"IF(J10=\"\",\"\",RANK(R10:R12,R10:R12,0))","v":2},null,{"$f":"$A$7","v":"SBC"},null,{"$f":"【進行】結果入力表!I32","v":"西峰"},null,{"$f":"【準備】登録!I13","v":180},{"$f":"IF(【進行】結果入力表!G32=\"\",\"\",【進行】結果入力表!G32)","v":"w"},null,{"$f":"IF(【進行】結果入力表!G48=\"\",\"\",【進行】結果入力表!G48)","v":"w"},null,null,null,{"$f":"IF(AD10=\"\",\"\",COUNTIF(Z12:AE12,\"w\"))","v":2},{"$f":"IF(AD10=\"\",\"\",COUNT(Z12,AB12))","v":0},{"$f":"SUM(Z12:AE12)+AF12*Y12","v":360},null,{"$f":"IF(AD10=\"\",\"\",AH12/Y12*180)","v":360},{"$f":"IF(AD10=\"w\",180,AD10/Y12*180)+IF(AD11=\"w\",180,AD11/Y12*180)","v":194},{"$f":"AF12*10000000+AJ12*AF10011*10000000+AJ12*1000-AK12","v":20359806},{"$f":"IF(AD10=\"\",\"\",RANK(AL10:AL12,AL10:AL12,0))","v":1},null,{"$f":"$A$7","v":"SBC"},null,{"$f":"【進行】結果入力表!I56","v":"西峰"},null,{"$f":"【準備】登録!I13","v":180},{"$f":"IF(【進行】結果入力表!G56=\"\",\"\",【進行】結果入力表!G56)","v":72},null,{"$f":"IF(【進行】結果入力表!G72=\"\",\"\",【進行】結果入力表!G72)","v":150},null,null,null,{"$f":"IF(AX10=\"\",\"\",COUNTIF(AT12:AY12,\"w\"))","v":0},{"$f":"IF(AX10=\"\",\"\",COUNT(AT12,AV12))","v":2},{"$f":"SUM(AT12:AY12)+AZ12*AS12","v":222},null,{"$f":"IF(AX10=\"\",\"\",BB12/AS12*180)","v":222},{"$f":"IF(AX10=\"w\",180,AX10/AS12*180)+IF(AX11=\"w\",180,AX11/AS12*180)","v":360},{"$f":"AZ12*10000000+BD12*AZ10011*10000000+BD12*1000-BE12","v":221640},{"$f":"IF(AX10=\"\",\"\",RANK(BF10:BF12,BF10:BF12,0))","v":3}]
[]
[3,null,"Name",null,{"$f":"E$4","v":"持点"},{"$f":"$A$5","v":"NRC"},null,{"$f":"$A$6","v":"WRC"},null,{"$f":"$A$7","v":"SBC"},null,"W","L","TP",null,"TP","LP","R_P","R",null,3,null,"Name",null,{"$f":"$E$4","v":"持点"},{"$f":"$A$5","v":"NRC"},null,{"$f":"$A$6","v":"WRC"},null,{"$f":"$A$7","v":"SBC"},null,"W","L","TP",null,"TP","LP","R_P","R",null,3,null,"Name",null,{"$f":"$E$4","v":"持点"},{"$f":"$A$5","v":"NRC"},null,{"$f":"$A$6","v":"WRC"},null,{"$f":"$A$7","v":"SBC"},null,"W","L","TP",null,"TP","LP","R_P","R"]
[{"$f":"$A$5","v":"NRC"},null,{"$f":"【進行】結果入力表!D9","v":"吉向"},null,{"$f":"【準備】登録!L11","v":180},null,null,{"$f":"IF(【進行】結果入力表!F17=\"\",\"\",【進行】結果入力表!F17)","v":"w"},null,{"$f":"IF(【進行】結果入力表!F9=\"\",\"\",【進行】結果入力表!F9)","v":"w"},null,{"$f":"IF(J15=\"\",\"\",COUNTIF(F15:K15,\"w\"))","v":2},{"$f":"IF(J15=\"\",\"\",COUNT(H15,J15))","v":0},{"$f":"SUM(F15:K15)+L15*E15","v":360},null,{"$f":"IF(J15=\"\",\"\",N15/E15*180)","v":360},{"$f":"IF(F16=\"w\",180,F16/E15*180)+IF(F17=\"w\",180,F17/E15*180)","v":321},{"$f":"L15*10000000+P15*L10014*10000000+P15*1000-Q15","v":20359679},{"$f":"IF(J15=\"\",\"\",RANK(R15:R17,R15:R17,0))","v":1},null,{"$f":"$A$5","v":"NRC"},null,{"$f":"【進行】結果入力表!D41","v":"斉藤"},null,{"$f":"【準備】登録!F11","v":180},null,null,{"$f":"IF(【進行】結果入力表!F41=\"\",\"\",【進行】結果入力表!F41)","v":"w"},null,{"$f":"IF(【進行】結果入力表!F33=\"\",\"\",【進行】結果入力表!F33)","v":107},null,{"$f":"IF(AD15=\"\",\"\",COUNTIF(Z15:AE15,\"w\"))","v":1},{"$f":"IF(AD15=\"\",\"\",COUNT(AB15,AD15))","v":1},{"$f":"SUM(Z15:AE15)+AF15*Y15","v":287},null,{"$f":"IF(AD15=\"\",\"\",AH15/Y15*180)","v":287},{"$f":"IF(Z16=\"w\",180,Z16/Y15*180)+IF(Z17=\"w\",180,Z17/Y15*180)","v":195},{"$f":"AF15*10000000+AJ15*AF10014*10000000+AJ15*1000-AK15","v":10286805},{"$f":"IF(AD15=\"\",\"\",RANK(AL15:AL17,AL15:AL17,0))","v":1},null,{"$f":"$A$5","v":"NRC"},null,{"$f":"【進行】結果入力表!D65","v":"岩本"},null,{"$f":"【準備】登録!U11","v":180},null,null,{"$f":"IF(【進行】結果入力表!F65=\"\",\"\",【進行】結果入力表!F65)","v":148},null,{"$f":"IF(【進行】結果入力表!F57=\"\",\"\",【進行】結果入力表!F57)","v":147},null,{"$f":"IF(AX15=\"\",\"\",COUNTIF(AT15:AY15,\"w\"))","v":0},{"$f":"IF(AX15=\"\",\"\",COUNT(AV15,AX15))","v":2},{"$f":"SUM(AT15:AY15)+AZ15*AS15","v":295},null,{"$f":"IF(AX15=\"\",\"\",BB15/AS15*180)","v":295},{"$f":"IF(AT16=\"w\",180,AT16/AS15*180)+IF(AT17=\"w\",180,AT17/AS15*180)","v":360},{"$f":"AZ15*10000000+BD15*AZ10014*10000000+BD15*1000-BE15","v":294640},{"$f":"IF(AX15=\"\",\"\",RANK(BF15:BF17,BF15:BF17,0))","v":3}]
[{"$f":"$A$6","v":"WRC"},null,{"$f":"【進行】結果入力表!I17","v":"末岡"},null,{"$f":"【準備】登録!L12","v":180},{"$f":"IF(【進行】結果入力表!G17=\"\",\"\",【進行】結果入力表!G17)","v":164},null,null,null,{"$f":"IF(【進行】結果入力表!F25=\"\",\"\",【進行】結果入力表!F25)","v":"w"},null,{"$f":"IF(J15=\"\",\"\",COUNTIF(F16:K16,\"w\"))","v":1},{"$f":"IF(J15=\"\",\"\",COUNT(F16,J16))","v":1},{"$f":"SUM(F16:K16)+L16*E16","v":344},null,{"$f":"IF(J15=\"\",\"\",N16/E16*180)","v":344},{"$f":"IF(H15=\"w\",180,H15/E16*180)+IF(H17=\"w\",180,H17/E16*180)","v":258},{"$f":"L16*10000000+P16*L10015*10000000+P16*1000-Q16","v":10343742},{"$f":"IF(J15=\"\",\"\",RANK(R15:R17,R15:R17,0))","v":2},null,{"$f":"$A$6","v":"WRC"},null,{"$f":"【進行】結果入力表!I41","v":"山中"},null,{"$f":"【準備】登録!I12","v":180},{"$f":"IF(【進行】結果入力表!G41=\"\",\"\",【進行】結果入力表!G41)","v":15},null,null,null,{"$f":"IF(【進行】結果入力表!F49=\"\",\"\",【進行】結果入力表!F49)","v":"w"},null,{"$f":"IF(AD15=\"\",\"\",COUNTIF(Z16:AE16,\"w\"))","v":1},{"$f":"IF(AD15=\"\",\"\",COUNT(Z16,AD16))","v":1},{"$f":"SUM(Z16:AE16)+AF16*Y16","v":195},null,{"$f":"IF(AD15=\"\",\"\",AH16/Y16*180)","v":195},{"$f":"IF(AB15=\"w\",180,AB15/Y16*180)+IF(AB17=\"w\",180,AB17/Y16*180)","v":284},{"$f":"AF16*10000000+AJ16*AF10015*10000000+AJ16*1000-AK16","v":10194716},{"$f":"IF(AD15=\"\",\"\",RANK(AL15:AL17,AL15:AL17,0))","v":3},null,{"$f":"$A$6","v":"WRC"},null,{"$f":"【進行】結果入力表!I65","v":"和田"},null,{"$f":"【準備】登録!F12","v":180},{"$f":"IF(【進行】結果入力表!G65=\"\",\"\",【進行】結果入力表!G65)","v":"w"},null,null,null,{"$f":"IF(【進行】結果入力表!F73=\"\",\"\",【進行】結果入力表!F73)","v":92},null,{"$f":"IF(AX15=\"\",\"\",COUNTIF(AT16:AY16,\"w\"))","v":1},{"$f":"IF(AX15=\"\",\"\",COUNT(AT16,AX16))","v":1},{"$f":"SUM(AT16:AY16)+AZ16*AS16","v":272},null,{"$f":"IF(AX15=\"\",\"\",BB16/AS16*180)","v":272},{"$f":"IF(AV15=\"w\",180,AV15/AS16*180)+IF(AV17=\"w\",180,AV17/AS16*180)","v":328},{"$f":"AZ16*10000000+BD16*AZ10015*10000000+BD16*1000-BE16","v":10271672},{"$f":"IF(AX15=\"\",\"\",RANK(BF15:BF17,BF15:BF17,0))","v":2}]
[{"$f":"$A$7","v":"SBC"},null,{"$f":"【進行】結果入力表!I9","v":"林"},null,{"$f":"【準備】登録!L13","v":180},{"$f":"IF(【進行】結果入力表!G9=\"\",\"\",【進行】結果入力表!G9)","v":157},null,{"$f":"IF(【進行】結果入力表!G25=\"\",\"\",【進行】結果入力表!G25)","v":78},null,null,null,{"$f":"IF(J15=\"\",\"\",COUNTIF(F17:K17,\"w\"))","v":0},{"$f":"IF(J15=\"\",\"\",COUNT(F17,H17))","v":2},{"$f":"SUM(F17:K17)+L17*E17","v":235},null,{"$f":"IF(J15=\"\",\"\",N17/E17*180)","v":235},{"$f":"IF(J15=\"w\",180,J15/E17*180)+IF(J16=\"w\",180,J16/E17*180)","v":360},{"$f":"L17*10000000+P17*L10016*10000000+P17*1000-Q17","v":234640},{"$f":"IF(J15=\"\",\"\",RANK(R15:R17,R15:R17,0))","v":3},null,{"$f":"$A$7","v":"SBC"},null,{"$f":"【進行】結果入力表!I33","v":"林"},null,{"$f":"【準備】登録!L13","v":180},{"$f":"IF(【進行】結果入力表!G33=\"\",\"\",【進行】結果入力表!G33)","v":"w"},null,{"$f":"IF(【進行】結果入力表!G49=\"\",\"\",【進行】結果入力表!G49)","v":104},null,null,null,{"$f":"IF(AD15=\"\",\"\",COUNTIF(Z17:AE17,\"w\"))","v":1},{"$f":"IF(AD15=\"\",\"\",COUNT(Z17,AB17))","v":1},{"$f":"SUM(Z17:AE17)+AF17*Y17","v":284},null,{"$f":"IF(AD15=\"\",\"\",AH17/Y17*180)","v":284},{"$f":"IF(AD15=\"w\",180,AD15/Y17*180)+IF(AD16=\"w\",180,AD16/Y17*180)","v":287},{"$f":"AF17*10000000+AJ17*AF10016*10000000+AJ17*1000-AK17","v":10283713},{"$f":"IF(AD15=\"\",\"\",RANK(AL15:AL17,AL15:AL17,0))","v":2},null,{"$f":"$A$7","v":"SBC"},null,{"$f":"【進行】結果入力表!I57","v":"林"},null,{"$f":"【準備】登録!L13","v":180},{"$f":"IF(【進行】結果入力表!G57=\"\",\"\",【進行】結果入力表!G57)","v":"w"},null,{"$f":"IF(【進行】結果入力表!G73=\"\",\"\",【進行】結果入力表!G73)","v":"w"},null,null,null,{"$f":"IF(AX15=\"\",\"\",COUNTIF(AT17:AY17,\"w\"))","v":2},{"$f":"IF(AX15=\"\",\"\",COUNT(AT17,AV17))","v":0},{"$f":"SUM(AT17:AY17)+AZ17*AS17","v":360},null,{"$f":"IF(AX15=\"\",\"\",BB17/AS17*180)","v":360},{"$f":"IF(AX15=\"w\",180,AX15/AS17*180)+IF(AX16=\"w\",180,AX16/AS17*180)","v":239},{"$f":"AZ17*10000000+BD17*AZ10016*10000000+BD17*1000-BE17","v":20359761},{"$f":"IF(AX15=\"\",\"\",RANK(BF15:BF17,BF15:BF17,0))","v":1}]
[]
[4,null,"Name",null,{"$f":"E$4","v":"持点"},{"$f":"$A$5","v":"NRC"},null,{"$f":"$A$6","v":"WRC"},null,{"$f":"$A$7","v":"SBC"},null,"W","L","TP",null,"TP","LP","R_P","R",null,4,null,"Name",null,{"$f":"$E$4","v":"持点"},{"$f":"$A$5","v":"NRC"},null,{"$f":"$A$6","v":"WRC"},null,{"$f":"$A$7","v":"SBC"},null,"W","L","TP",null,"TP","LP","R_P","R",null,4,null,"Name",null,{"$f":"$E$4","v":"持点"},{"$f":"$A$5","v":"NRC"},null,{"$f":"$A$6","v":"WRC"},null,{"$f":"$A$7","v":"SBC"},null,"W","L","TP",null,"TP","LP","R_P","R"]
[{"$f":"$A$5","v":"NRC"},null,{"$f":"【進行】結果入力表!D10","v":"白戸"},null,{"$f":"【準備】登録!O11","v":180},null,null,{"$f":"IF(【進行】結果入力表!F18=\"\",\"\",【進行】結果入力表!F18)","v":57},null,{"$f":"IF(【進行】結果入力表!F10=\"\",\"\",【進行】結果入力表!F10)","v":"w"},null,{"$f":"IF(J20=\"\",\"\",COUNTIF(F20:K20,\"w\"))","v":1},{"$f":"IF(J20=\"\",\"\",COUNT(H20,J20))","v":1},{"$f":"SUM(F20:K20)+L20*E20","v":237},null,{"$f":"IF(J20=\"\",\"\",N20/E20*180)","v":237},{"$f":"IF(F21=\"w\",180,F21/E20*180)+IF(F22=\"w\",180,F22/E20*180)","v":298},{"$f":"L20*10000000+P20*L10019*10000000+P20*1000-Q20","v":10236702},{"$f":"IF(J20=\"\",\"\",RANK(R20:R22,R20:R22,0))","v":2},null,{"$f":"$A$5","v":"NRC"},null,{"$f":"【進行】結果入力表!D42","v":"山田"},null,{"$f":"【準備】登録!I11","v":180},null,null,{"$f":"IF(【進行】結果入力表!F42=\"\",\"\",【進行】結果入力表!F42)","v":"w"},null,{"$f":"IF(【進行】結果入力表!F34=\"\",\"\",【進行】結果入力表!F34)","v":"w"},null,{"$f":"IF(AD20=\"\",\"\",COUNTIF(Z20:AE20,\"w\"))","v":2},{"$f":"IF(AD20=\"\",\"\",COUNT(AB20,AD20))","v":0},{"$f":"SUM(Z20:AE20)+AF20*Y20","v":360},null,{"$f":"IF(AD20=\"\",\"\",AH20/Y20*180)","v":360},{"$f":"IF(Z21=\"w\",180,Z21/Y20*180)+IF(Z22=\"w\",180,Z22/Y20*180)","v":282},{"$f":"AF20*10000000+AJ20*AF10019*10000000+AJ20*1000-AK20","v":20359718},{"$f":"IF(AD20=\"\",\"\",RANK(AL20:AL22,AL20:AL22,0))","v":1},null,{"$f":"$A$5","v":"NRC"},null,{"$f":"【進行】結果入力表!D66","v":"白戸"},null,{"$f":"【準備】登録!X11","v":140},null,null,{"$f":"IF(【進行】結果入力表!F66=\"\",\"\",【進行】結果入力表!F66)","v":138},null,{"$f":"IF(【進行】結果入力表!F58=\"\",\"\",【進行】結果入力表!F58)","v":"w"},null,{"$f":"IF(AX20=\"\",\"\",COUNTIF(AT20:AY20,\"w\"))","v":1},{"$f":"IF(AX20=\"\",\"\",COUNT(AV20,AX20))","v":1},{"$f":"SUM(AT20:AY20)+AZ20*AS20","v":278},null,{"$f":"IF(AX20=\"\",\"\",BB20/AS20*180)","v":357.42857142857144},{"$f":"IF(AT21=\"w\",180,AT21/AS20*180)+IF(AT22=\"w\",180,AT22/AS20*180)","v":379.28571428571433},{"$f":"AZ20*10000000+BD20*AZ10019*10000000+BD20*1000-BE20","v":10357049.285714285},{"$f":"IF(AX20=\"\",\"\",RANK(BF20:BF22,BF20:BF22,0))","v":1}]
[{"$f":"$A$6","v":"WRC"},null,{"$f":"【進行】結果入力表!I18","v":"杉本"},null,{"$f":"【準備】登録!O12","v":180},{"$f":"IF(【進行】結果入力表!G18=\"\",\"\",【進行】結果入力表!G18)","v":"w"},null,null,null,{"$f":"IF(【進行】結果入力表!F26=\"\",\"\",【進行】結果入力表!F26)","v":"w"},null,{"$f":"IF(J20=\"\",\"\",COUNTIF(F21:K21,\"w\"))","v":2},{"$f":"IF(J20=\"\",\"\",COUNT(F21,J21))","v":0},{"$f":"SUM(F21:K21)+L21*E21","v":360},null,{"$f":"IF(J20=\"\",\"\",N21/E21*180)","v":360},{"$f":"IF(H20=\"w\",180,H20/E21*180)+IF(H22=\"w\",180,H22/E21*180)","v":130},{"$f":"L21*10000000+P21*L10020*10000000+P21*1000-Q21","v":20359870},{"$f":"IF(J20=\"\",\"\",RANK(R20:R22,R20:R22,0))","v":1},null,{"$f":"$A$6","v":"WRC"},null,{"$f":"【進行】結果入力表!I42","v":"末岡"},null,{"$f":"【準備】登録!L12","v":180},{"$f":"IF(【進行】結果入力表!G42=\"\",\"\",【進行】結果入力表!G42)","v":145},null,null,null,{"$f":"IF(【進行】結果入力表!F50=\"\",\"\",【進行】結果入力表!F50)","v":"w"},null,{"$f":"IF(AD20=\"\",\"\",COUNTIF(Z21:AE21,\"w\"))","v":1},{"$f":"IF(AD20=\"\",\"\",COUNT(Z21,AD21))","v":1},{"$f":"SUM(Z21:AE21)+AF21*Y21","v":325},null,{"$f":"IF(AD20=\"\",\"\",AH21/Y21*180)","v":325},{"$f":"IF(AB20=\"w\",180,AB20/Y21*180)+IF(AB22=\"w\",180,AB22/Y21*180)","v":331},{"$f":"AF21*10000000+AJ21*AF10020*10000000+AJ21*1000-AK21","v":10324669},{"$f":"IF(AD20=\"\",\"\",RANK(AL20:AL22,AL20:AL22,0))","v":2},null,{"$f":"$A$6","v":"WRC"},null,{"$f":"【進行】結果入力表!I66","v":"山中"},null,{"$f":"【準備】登録!I12","v":180},{"$f":"IF(【進行】結果入力表!G66=\"\",\"\",【進行】結果入力表!G66)","v":"w"},null,null,null,{"$f":"IF(【進行】結果入力表!F74=\"\",\"\",【進行】結果入力表!F74)","v":131},null,{"$f":"IF(AX20=\"\",\"\",COUNTIF(AT21:AY21,\"w\"))","v":1},{"$f":"IF(AX20=\"\",\"\",COUNT(AT21,AX21))","v":1},{"$f":"SUM(AT21:AY21)+AZ21*AS21","v":311},null,{"$f":"IF(AX20=\"\",\"\",BB21/AS21*180)","v":311},{"$f":"IF(AV20=\"w\",180,AV20/AS21*180)+IF(AV22=\"w\",180,AV22/AS21*180)","v":318},{"$f":"AZ21*10000000+BD21*AZ10020*10000000+BD21*1000-BE21","v":10310682},{"$f":"IF(AX20=\"\",\"\",RANK(BF20:BF22,BF20:BF22,0))","v":3}]
[{"$f":"$A$7","v":"SBC"},null,{"$f":"【進行】結果入力表!I10","v":"秋田"},null,{"$f":"【準備】登録!O13","v":180},{"$f":"IF(【進行】結果入力表!G10=\"\",\"\",【進行】結果入力表!G10)","v":118},null,{"$f":"IF(【進行】結果入力表!G26=\"\",\"\",【進行】結果入力表!G26)","v":73},null,null,null,{"$f":"IF(J20=\"\",\"\",COUNTIF(F22:K22,\"w\"))","v":0},{"$f":"IF(J20=\"\",\"\",COUNT(F22,H22))","v":2},{"$f":"SUM(F22:K22)+L22*E22","v":191},null,{"$f":"IF(J20=\"\",\"\",N22/E22*180)","v":191},{"$f":"IF(J20=\"w\",180,J20/E22*180)+IF(J21=\"w\",180,J21/E22*180)","v":360},{"$f":"L22*10000000+P22*L10021*10000000+P22*1000-Q22","v":190640},{"$f":"IF(J20=\"\",\"\",RANK(R20:R22,R20:R22,0))","v":3},null,{"$f":"$A$7","v":"SBC"},null,{"$f":"【進行】結果入力表!I34","v":"秋田"},null,{"$f":"【準備】登録!O13","v":180},{"$f":"IF(【進行】結果入力表!G34=\"\",\"\",【進行】結果入力表!G34)","v":137},null,{"$f":"IF(【進行】結果入力表!G50=\"\",\"\",【進行】結果入力表!G50)","v":151},null,null,null,{"$f":"IF(AD20=\"\",\"\",COUNTIF(Z22:AE22,\"w\"))","v":0},{"$f":"IF(AD20=\"\",\"\",COUNT(Z22,AB22))","v":2},{"$f":"SUM(Z22:AE22)+AF22*Y22","v":288},null,{"$f":"IF(AD20=\"\",\"\",AH22/Y22*180)","v":288},{"$f":"IF(AD20=\"w\",180,AD20/Y22*180)+IF(AD21=\"w\",180,AD21/Y22*180)","v":360},{"$f":"AF22*10000000+AJ22*AF10021*10000000+AJ22*1000-AK22","v":287640},{"$f":"IF(AD20=\"\",\"\",RANK(AL20:AL22,AL20:AL22,0))","v":3},null,{"$f":"$A$7","v":"SBC"},null,{"$f":"【進行】結果入力表!I58","v":"秋田"},null,{"$f":"【準備】登録!O13","v":180},{"$f":"IF(【進行】結果入力表!G58=\"\",\"\",【進行】結果入力表!G58)","v":155},null,{"$f":"IF(【進行】結果入力表!G74=\"\",\"\",【進行】結果入力表!G74)","v":"w"},null,null,null,{"$f":"IF(AX20=\"\",\"\",COUNTIF(AT22:AY22,\"w\"))","v":1},{"$f":"IF(AX20=\"\",\"\",COUNT(AT22,AV22))","v":1},{"$f":"SUM(AT22:AY22)+AZ22*AS22","v":335},null,{"$f":"IF(AX20=\"\",\"\",BB22/AS22*180)","v":335},{"$f":"IF(AX20=\"w\",180,AX20/AS22*180)+IF(AX21=\"w\",180,AX21/AS22*180)","v":311},{"$f":"AZ22*10000000+BD22*AZ10021*10000000+BD22*1000-BE22","v":10334689},{"$f":"IF(AX20=\"\",\"\",RANK(BF20:BF22,BF20:BF22,0))","v":2}]
[]
[5,null,"Name",null,{"$f":"E$4","v":"持点"},{"$f":"$A$5","v":"NRC"},null,{"$f":"$A$6","v":"WRC"},null,{"$f":"$A$7","v":"SBC"},null,"W","L","TP",null,"TP","LP","R_P","R",null,5,null,"Name",null,{"$f":"$E$4","v":"持点"},{"$f":"$A$5","v":"NRC"},null,{"$f":"$A$6","v":"WRC"},null,{"$f":"$A$7","v":"SBC"},null,"W","L","TP",null,"TP","LP","R_P","R",null,5,null,"Name",null,{"$f":"$E$4","v":"持点"},{"$f":"$A$5","v":"NRC"},null,{"$f":"$A$6","v":"WRC"},null,{"$f":"$A$7","v":"SBC"},null,"W","L","TP",null,"TP","LP","R_P","R"]
[{"$f":"$A$5","v":"NRC"},null,{"$f":"【進行】結果入力表!D11","v":"植田"},null,{"$f":"【準備】登録!R11","v":180},null,null,{"$f":"IF(【進行】結果入力表!F19=\"\",\"\",【進行】結果入力表!F19)","v":"w"},null,{"$f":"IF(【進行】結果入力表!F11=\"\",\"\",【進行】結果入力表!F11)","v":"w"},null,{"$f":"IF(J25=\"\",\"\",COUNTIF(F25:K25,\"w\"))","v":2},{"$f":"IF(J25=\"\",\"\",COUNT(H25,J25))","v":0},{"$f":"SUM(F25:K25)+L25*E25","v":360},null,{"$f":"IF(J25=\"\",\"\",N25/E25*180)","v":360},{"$f":"IF(F26=\"w\",180,F26/E25*180)+IF(F27=\"w\",180,F27/E25*180)","v":162},{"$f":"L25*10000000+P25*L10024*10000000+P25*1000-Q25","v":20359838},{"$f":"IF(J25=\"\",\"\",RANK(R25:R27,R25:R27,0))","v":1},null,{"$f":"$A$5","v":"NRC"},null,{"$f":"【進行】結果入力表!D43","v":"吉向"},null,{"$f":"【準備】登録!L11","v":180},null,null,{"$f":"IF(【進行】結果入力表!F43=\"\",\"\",【進行】結果入力表!F43)","v":"w"},null,{"$f":"IF(【進行】結果入力表!F35=\"\",\"\",【進行】結果入力表!F35)","v":"w"},null,{"$f":"IF(AD25=\"\",\"\",COUNTIF(Z25:AE25,\"w\"))","v":2},{"$f":"IF(AD25=\"\",\"\",COUNT(AB25,AD25))","v":0},{"$f":"SUM(Z25:AE25)+AF25*Y25","v":360},null,{"$f":"IF(AD25=\"\",\"\",AH25/Y25*180)","v":360},{"$f":"IF(Z26=\"w\",180,Z26/Y25*180)+IF(Z27=\"w\",180,Z27/Y25*180)","v":333},{"$f":"AF25*10000000+AJ25*AF10024*10000000+AJ25*1000-AK25","v":20359667},{"$f":"IF(AD25=\"\",\"\",RANK(AL25:AL27,AL25:AL27,0))","v":1},null,{"$f":"$A$5","v":"NRC"},null,{"$f":"【進行】結果入力表!D67","v":"斉藤"},null,{"$f":"【準備】登録!F11","v":180},null,null,{"$f":"IF(【進行】結果入力表!F67=\"\",\"\",【進行】結果入力表!F67)","v":"w"},null,{"$f":"IF(【進行】結果入力表!F59=\"\",\"\",【進行】結果入力表!F59)","v":87},null,{"$f":"IF(AX25=\"\",\"\",COUNTIF(AT25:AY25,\"w\"))","v":1},{"$f":"IF(AX25=\"\",\"\",COUNT(AV25,AX25))","v":1},{"$f":"SUM(AT25:AY25)+AZ25*AS25","v":267},null,{"$f":"IF(AX25=\"\",\"\",BB25/AS25*180)","v":267},{"$f":"IF(AT26=\"w\",180,AT26/AS25*180)+IF(AT27=\"w\",180,AT27/AS25*180)","v":272},{"$f":"AZ25*10000000+BD25*AZ10024*10000000+BD25*1000-BE25","v":10266728},{"$f":"IF(AX25=\"\",\"\",RANK(BF25:BF27,BF25:BF27,0))","v":3}]
[{"$f":"$A$6","v":"WRC"},null,{"$f":"【進行】結果入力表!I19","v":"大迫"},null,{"$f":"【準備】登録!R12","v":180},{"$f":"IF(【進行】結果入力表!G19=\"\",\"\",【進行】結果入力表!G19)","v":21},null,null,null,{"$f":"IF(【進行】結果入力表!F27=\"\",\"\",【進行】結果入力表!F27)","v":74},null,{"$f":"IF(J25=\"\",\"\",COUNTIF(F26:K26,\"w\"))","v":0},{"$f":"IF(J25=\"\",\"\",COUNT(F26,J26))","v":2},{"$f":"SUM(F26:K26)+L26*E26","v":95},null,{"$f":"IF(J25=\"\",\"\",N26/E26*180)","v":95},{"$f":"IF(H25=\"w\",180,H25/E26*180)+IF(H27=\"w\",180,H27/E26*180)","v":360},{"$f":"L26*10000000+P26*L10025*10000000+P26*1000-Q26","v":94640},{"$f":"IF(J25=\"\",\"\",RANK(R25:R27,R25:R27,0))","v":3},null,{"$f":"$A$6","v":"WRC"},null,{"$f":"【進行】結果入力表!I43","v":"杉本"},null,{"$f":"【準備】登録!O12","v":180},{"$f":"IF(【進行】結果入力表!G43=\"\",\"\",【進行】結果入力表!G43)","v":164},null,null,null,{"$f":"IF(【進行】結果入力表!F51=\"\",\"\",【進行】結果入力表!F51)","v":"w"},null,{"$f":"IF(AD25=\"\",\"\",COUNTIF(Z26:AE26,\"w\"))","v":1},{"$f":"IF(AD25=\"\",\"\",COUNT(Z26,AD26))","v":1},{"$f":"SUM(Z26:AE26)+AF26*Y26","v":344},null,{"$f":"IF(AD25=\"\",\"\",AH26/Y26*180)","v":344},{"$f":"IF(AB25=\"w\",180,AB25/Y26*180)+IF(AB27=\"w\",180,AB27/Y26*180)","v":255},{"$f":"AF26*10000000+AJ26*AF10025*10000000+AJ26*1000-AK26","v":10343745},{"$f":"IF(AD25=\"\",\"\",RANK(AL25:AL27,AL25:AL27,0))","v":2},null,{"$f":"$A$6","v":"WRC"},null,{"$f":"【進行】結果入力表!I67","v":"末岡"},null,{"$f":"【準備】登録!L12","v":180},{"$f":"IF(【進行】結果入力表!G67=\"\",\"\",【進行】結果入力表!G67)","v":92},null,null,null,{"$f":"IF(【進行】結果入力表!F75=\"\",\"\",【進行】結果入力表!F75)","v":"w"},null,{"$f":"IF(AX25=\"\",\"\",COUNTIF(AT26:AY26,\"w\"))","v":1},{"$f":"IF(AX25=\"\",\"\",COUNT(AT26,AX26))","v":1},{"$f":"SUM(AT26:AY26)+AZ26*AS26","v":272},null,{"$f":"IF(AX25=\"\",\"\",BB26/AS26*180)","v":272},{"$f":"IF(AV25=\"w\",180,AV25/AS26*180)+IF(AV27=\"w\",180,AV27/AS26*180)","v":338},{"$f":"AZ26*10000000+BD26*AZ10025*10000000+BD26*1000-BE26","v":10271662},{"$f":"IF(AX25=\"\",\"\",RANK(BF25:BF27,BF25:BF27,0))","v":2}]
[{"$f":"$A$7","v":"SBC"},null,{"$f":"【進行】結果入力表!I11","v":"山中"},null,{"$f":"【準備】登録!R13","v":180},{"$f":"IF(【進行】結果入力表!G11=\"\",\"\",【進行】結果入力表!G11)","v":141},null,{"$f":"IF(【進行】結果入力表!G27=\"\",\"\",【進行】結果入力表!G27)","v":"w"},null,null,null,{"$f":"IF(J25=\"\",\"\",COUNTIF(F27:K27,\"w\"))","v":1},{"$f":"IF(J25=\"\",\"\",COUNT(F27,H27))","v":1},{"$f":"SUM(F27:K27)+L27*E27","v":321},null,{"$f":"IF(J25=\"\",\"\",N27/E27*180)","v":321},{"$f":"IF(J25=\"w\",180,J25/E27*180)+IF(J26=\"w\",180,J26/E27*180)","v":254},{"$f":"L27*10000000+P27*L10026*10000000+P27*1000-Q27","v":10320746},{"$f":"IF(J25=\"\",\"\",RANK(R25:R27,R25:R27,0))","v":2},null,{"$f":"$A$7","v":"SBC"},null,{"$f":"【進行】結果入力表!I35","v":"山中"},null,{"$f":"【準備】登録!R13","v":180},{"$f":"IF(【進行】結果入力表!G35=\"\",\"\",【進行】結果入力表!G35)","v":169},null,{"$f":"IF(【進行】結果入力表!G51=\"\",\"\",【進行】結果入力表!G51)","v":75},null,null,null,{"$f":"IF(AD25=\"\",\"\",COUNTIF(Z27:AE27,\"w\"))","v":0},{"$f":"IF(AD25=\"\",\"\",COUNT(Z27,AB27))","v":2},{"$f":"SUM(Z27:AE27)+AF27*Y27","v":244},null,{"$f":"IF(AD25=\"\",\"\",AH27/Y27*180)","v":244},{"$f":"IF(AD25=\"w\",180,AD25/Y27*180)+IF(AD26=\"w\",180,AD26/Y27*180)","v":360},{"$f":"AF27*10000000+AJ27*AF10026*10000000+AJ27*1000-AK27","v":243640},{"$f":"IF(AD25=\"\",\"\",RANK(AL25:AL27,AL25:AL27,0))","v":3},null,{"$f":"$A$7","v":"SBC"},null,{"$f":"【進行】結果入力表!I59","v":"山中"},null,{"$f":"【準備】登録!R13","v":180},{"$f":"IF(【進行】結果入力表!G59=\"\",\"\",【進行】結果入力表!G59)","v":"w"},null,{"$f":"IF(【進行】結果入力表!G75=\"\",\"\",【進行】結果入力表!G75)","v":158},null,null,null,{"$f":"IF(AX25=\"\",\"\",COUNTIF(AT27:AY27,\"w\"))","v":1},{"$f":"IF(AX25=\"\",\"\",COUNT(AT27,AV27))","v":1},{"$f":"SUM(AT27:AY27)+AZ27*AS27","v":338},null,{"$f":"IF(AX25=\"\",\"\",BB27/AS27*180)","v":338},{"$f":"IF(AX25=\"w\",180,AX25/AS27*180)+IF(AX26=\"w\",180,AX26/AS27*180)","v":267},{"$f":"AZ27*10000000+BD27*AZ10026*10000000+BD27*1000-BE27","v":10337733},{"$f":"IF(AX25=\"\",\"\",RANK(BF25:BF27,BF25:BF27,0))","v":1}]
[]
[6,null,"Name",null,{"$f":"E$4","v":"持点"},{"$f":"$A$5","v":"NRC"},null,{"$f":"$A$6","v":"WRC"},null,{"$f":"$A$7","v":"SBC"},null,"W","L","TP",null,"TP","LP","R_P","R",null,6,null,"Name",null,{"$f":"$E$4","v":"持点"},{"$f":"$A$5","v":"NRC"},null,{"$f":"$A$6","v":"WRC"},null,{"$f":"$A$7","v":"SBC"},null,"W","L","TP",null,"TP","LP","R_P","R",null,6,null,"Name",null,{"$f":"$E$4","v":"持点"},{"$f":"$A$5","v":"NRC"},null,{"$f":"$A$6","v":"WRC"},null,{"$f":"$A$7","v":"SBC"},null,"W","L","TP",null,"TP","LP","R_P","R"]
[{"$f":"$A$5","v":"NRC"},null,{"$f":"【進行】結果入力表!D12","v":"岩本"},null,{"$f":"【準備】登録!U11","v":180},null,null,{"$f":"IF(【進行】結果入力表!F20=\"\",\"\",【進行】結果入力表!F20)","v":"w"},null,{"$f":"IF(【進行】結果入力表!F12=\"\",\"\",【進行】結果入力表!F12)","v":"w"},null,{"$f":"IF(J30=\"\",\"\",COUNTIF(F30:K30,\"w\"))","v":2},{"$f":"IF(J30=\"\",\"\",COUNT(H30,J30))","v":0},{"$f":"SUM(F30:K30)+L30*E30","v":360},null,{"$f":"IF(J30=\"\",\"\",N30/E30*180)","v":360},{"$f":"IF(F31=\"w\",180,F31/E30*180)+IF(F32=\"w\",180,F32/E30*180)","v":277},{"$f":"L30*10000000+P30*L10029*10000000+P30*1000-Q30","v":20359723},{"$f":"IF(J30=\"\",\"\",RANK(R30:R32,R30:R32,0))","v":1},null,{"$f":"$A$5","v":"NRC"},null,{"$f":"【進行】結果入力表!D44","v":"白戸"},null,{"$f":"【準備】登録!O11","v":180},null,null,{"$f":"IF(【進行】結果入力表!F44=\"\",\"\",【進行】結果入力表!F44)","v":"w"},null,{"$f":"IF(【進行】結果入力表!F36=\"\",\"\",【進行】結果入力表!F36)","v":"w"},null,{"$f":"IF(AD30=\"\",\"\",COUNTIF(Z30:AE30,\"w\"))","v":2},{"$f":"IF(AD30=\"\",\"\",COUNT(AB30,AD30))","v":0},{"$f":"SUM(Z30:AE30)+AF30*Y30","v":360},null,{"$f":"IF(AD30=\"\",\"\",AH30/Y30*180)","v":360},{"$f":"IF(Z31=\"w\",180,Z31/Y30*180)+IF(Z32=\"w\",180,Z32/Y30*180)","v":105},{"$f":"AF30*10000000+AJ30*AF10029*10000000+AJ30*1000-AK30","v":20359895},{"$f":"IF(AD30=\"\",\"\",RANK(AL30:AL32,AL30:AL32,0))","v":1},null,{"$f":"$A$5","v":"NRC"},null,{"$f":"【進行】結果入力表!D68","v":"山田"},null,{"$f":"【準備】登録!I11","v":180},null,null,{"$f":"IF(【進行】結果入力表!F68=\"\",\"\",【進行】結果入力表!F68)","v":141},null,{"$f":"IF(【進行】結果入力表!F60=\"\",\"\",【進行】結果入力表!F60)","v":"w"},null,{"$f":"IF(AX30=\"\",\"\",COUNTIF(AT30:AY30,\"w\"))","v":1},{"$f":"IF(AX30=\"\",\"\",COUNT(AV30,AX30))","v":1},{"$f":"SUM(AT30:AY30)+AZ30*AS30","v":321},null,{"$f":"IF(AX30=\"\",\"\",BB30/AS30*180)","v":321},{"$f":"IF(AT31=\"w\",180,AT31/AS30*180)+IF(AT32=\"w\",180,AT32/AS30*180)","v":242},{"$f":"AZ30*10000000+BD30*AZ10029*10000000+BD30*1000-BE30","v":10320758},{"$f":"IF(AX30=\"\",\"\",RANK(BF30:BF32,BF30:BF32,0))","v":2}]
[{"$f":"$A$6","v":"WRC"},null,{"$f":"【進行】結果入力表!I20","v":"中本"},null,{"$f":"【準備】登録!U12","v":180},{"$f":"IF(【進行】結果入力表!G20=\"\",\"\",【進行】結果入力表!G20)","v":113},null,null,null,{"$f":"IF(【進行】結果入力表!F28=\"\",\"\",【進行】結果入力表!F28)","v":"w"},null,{"$f":"IF(J30=\"\",\"\",COUNTIF(F31:K31,\"w\"))","v":1},{"$f":"IF(J30=\"\",\"\",COUNT(F31,J31))","v":1},{"$f":"SUM(F31:K31)+L31*E31","v":293},null,{"$f":"IF(J30=\"\",\"\",N31/E31*180)","v":293},{"$f":"IF(H30=\"w\",180,H30/E31*180)+IF(H32=\"w\",180,H32/E31*180)","v":300},{"$f":"L31*10000000+P31*L10030*10000000+P31*1000-Q31","v":10292700},{"$f":"IF(J30=\"\",\"\",RANK(R30:R32,R30:R32,0))","v":2},null,{"$f":"$A$6","v":"WRC"},null,{"$f":"【進行】結果入力表!I44","v":"大迫"},null,{"$f":"【準備】登録!R12","v":180},{"$f":"IF(【進行】結果入力表!G44=\"\",\"\",【進行】結果入力表!G44)","v":48},null,null,null,{"$f":"IF(【進行】結果入力表!F52=\"\",\"\",【進行】結果入力表!F52)","v":142},null,{"$f":"IF(AD30=\"\",\"\",COUNTIF(Z31:AE31,\"w\"))","v":0},{"$f":"IF(AD30=\"\",\"\",COUNT(Z31,AD31))","v":2},{"$f":"SUM(Z31:AE31)+AF31*Y31","v":190},null,{"$f":"IF(AD30=\"\",\"\",AH31/Y31*180)","v":190},{"$f":"IF(AB30=\"w\",180,AB30/Y31*180)+IF(AB32=\"w\",180,AB32/Y31*180)","v":360},{"$f":"AF31*10000000+AJ31*AF10030*10000000+AJ31*1000-AK31","v":189640},{"$f":"IF(AD30=\"\",\"\",RANK(AL30:AL32,AL30:AL32,0))","v":3},null,{"$f":"$A$6","v":"WRC"},null,{"$f":"【進行】結果入力表!I68","v":"杉本"},null,{"$f":"【準備】登録!O12","v":180},{"$f":"IF(【進行】結果入力表!G68=\"\",\"\",【進行】結果入力表!G68)","v":"w"},null,null,null,{"$f":"IF(【進行】結果入力表!F76=\"\",\"\",【進行】結果入力表!F76)","v":"w"},null,{"$f":"IF(AX30=\"\",\"\",COUNTIF(AT31:AY31,\"w\"))","v":2},{"$f":"IF(AX30=\"\",\"\",COUNT(AT31,AX31))","v":0},{"$f":"SUM(AT31:AY31)+AZ31*AS31","v":360},null,{"$f":"IF(AX30=\"\",\"\",BB31/AS31*180)","v":360},{"$f":"IF(AV30=\"w\",180,AV30/AS31*180)+IF(AV32=\"w\",180,AV32/AS31*180)","v":236},{"$f":"AZ31*10000000+BD31*AZ10030*10000000+BD31*1000-BE31","v":20359764},{"$f":"IF(AX30=\"\",\"\",RANK(BF30:BF32,BF30:BF32,0))","v":1}]
[{"$f":"$A$7","v":"SBC"},null,{"$f":"【進行】結果入力表!I12","v":"柳川"},null,{"$f":"【準備】登録!U13","v":180},{"$f":"IF(【進行】結果入力表!G12=\"\",\"\",【進行】結果入力表!G12)","v":164},null,{"$f":"IF(【進行】結果入力表!G28=\"\",\"\",【進行】結果入力表!G28)","v":120},null,null,null,{"$f":"IF(J30=\"\",\"\",COUNTIF(F32:K32,\"w\"))","v":0},{"$f":"IF(J30=\"\",\"\",COUNT(F32,H32))","v":2},{"$f":"SUM(F32:K32)+L32*E32","v":284},null,{"$f":"IF(J30=\"\",\"\",N32/E32*180)","v":284},{"$f":"IF(J30=\"w\",180,J30/E32*180)+IF(J31=\"w\",180,J31/E32*180)","v":360},{"$f":"L32*10000000+P32*L10031*10000000+P32*1000-Q32","v":283640},{"$f":"IF(J30=\"\",\"\",RANK(R30:R32,R30:R32,0))","v":3},null,{"$f":"$A$7","v":"SBC"},null,{"$f":"【進行】結果入力表!I36","v":"柳川"},null,{"$f":"【準備】登録!U13","v":180},{"$f":"IF(【進行】結果入力表!G36=\"\",\"\",【進行】結果入力表!G36)","v":57},null,{"$f":"IF(【進行】結果入力表!G52=\"\",\"\",【進行】結果入力表!G52)","v":"w"},null,null,null,{"$f":"IF(AD30=\"\",\"\",COUNTIF(Z32:AE32,\"w\"))","v":1},{"$f":"IF(AD30=\"\",\"\",COUNT(Z32,AB32))","v":1},{"$f":"SUM(Z32:AE32)+AF32*Y32","v":237},null,{"$f":"IF(AD30=\"\",\"\",AH32/Y32*180)","v":237},{"$f":"IF(AD30=\"w\",180,AD30/Y32*180)+IF(AD31=\"w\",180,AD31/Y32*180)","v":322},{"$f":"AF32*10000000+AJ32*AF10031*10000000+AJ32*1000-AK32","v":10236678},{"$f":"IF(AD30=\"\",\"\",RANK(AL30:AL32,AL30:AL32,0))","v":2},null,{"$f":"$A$7","v":"SBC"},null,{"$f":"【進行】結果入力表!I60","v":"柳川"},null,{"$f":"【準備】登録!U13","v":180},{"$f":"IF(【進行】結果入力表!G60=\"\",\"\",【進行】結果入力表!G60)","v":62},null,{"$f":"IF(【進行】結果入力表!G76=\"\",\"\",【進行】結果入力表!G76)","v":95},null,null,null,{"$f":"IF(AX30=\"\",\"\",COUNTIF(AT32:AY32,\"w\"))","v":0},{"$f":"IF(AX30=\"\",\"\",COUNT(AT32,AV32))","v":2},{"$f":"SUM(AT32:AY32)+AZ32*AS32","v":157},null,{"$f":"IF(AX30=\"\",\"\",BB32/AS32*180)","v":157},{"$f":"IF(AX30=\"w\",180,AX30/AS32*180)+IF(AX31=\"w\",180,AX31/AS32*180)","v":360},{"$f":"AZ32*10000000+BD32*AZ10031*10000000+BD32*1000-BE32","v":156640},{"$f":"IF(AX30=\"\",\"\",RANK(BF30:BF32,BF30:BF32,0))","v":3}]
[]
[7,null,"Name",null,{"$f":"E$4","v":"持点"},{"$f":"$A$5","v":"NRC"},null,{"$f":"$A$6","v":"WRC"},null,{"$f":"$A$7","v":"SBC"},null,"W","L","TP",null,"TP","LP","R_P","R",null,7,null,"Name",null,{"$f":"$E$4","v":"持点"},{"$f":"$A$5","v":"NRC"},null,{"$f":"$A$6","v":"WRC"},null,{"$f":"$A$7","v":"SBC"},null,"W","L","TP",null,"TP","LP","R_P","R",null,7,null,"Name",null,{"$f":"$E$4","v":"持点"},{"$f":"$A$5","v":"NRC"},null,{"$f":"$A$6","v":"WRC"},null,{"$f":"$A$7","v":"SBC"},null,"W","L","TP",null,"TP","LP","R_P","R"]
[{"$f":"$A$5","v":"NRC"},null,{"$f":"【進行】結果入力表!D13","v":"白戸"},null,{"$f":"【準備】登録!X11","v":140},null,null,{"$f":"IF(【進行】結果入力表!F21=\"\",\"\",【進行】結果入力表!F21)","v":"w"},null,{"$f":"IF(【進行】結果入力表!F13=\"\",\"\",【進行】結果入力表!F13)","v":"w"},null,{"$f":"IF(J35=\"\",\"\",COUNTIF(F35:K35,\"w\"))","v":2},{"$f":"IF(J35=\"\",\"\",COUNT(H35,J35))","v":0},{"$f":"SUM(F35:K35)+L35*E35","v":280},null,{"$f":"IF(J35=\"\",\"\",N35/E35*180)","v":360},{"$f":"IF(F36=\"w\",180,F36/E35*180)+IF(F37=\"w\",180,F37/E35*180)","v":195.42857142857144},{"$f":"L35*10000000+P35*L10034*10000000+P35*1000-Q35","v":20359804.571428571},{"$f":"IF(J35=\"\",\"\",RANK(R35:R37,R35:R37,0))","v":1},null,{"$f":"$A$5","v":"NRC"},null,{"$f":"【進行】結果入力表!D45","v":"植田"},null,{"$f":"【準備】登録!R11","v":180},null,null,{"$f":"IF(【進行】結果入力表!F45=\"\",\"\",【進行】結果入力表!F45)","v":"w"},null,{"$f":"IF(【進行】結果入力表!F37=\"\",\"\",【進行】結果入力表!F37)","v":"w"},null,{"$f":"IF(AD35=\"\",\"\",COUNTIF(Z35:AE35,\"w\"))","v":2},{"$f":"IF(AD35=\"\",\"\",COUNT(AB35,AD35))","v":0},{"$f":"SUM(Z35:AE35)+AF35*Y35","v":360},null,{"$f":"IF(AD35=\"\",\"\",AH35/Y35*180)","v":360},{"$f":"IF(Z36=\"w\",180,Z36/Y35*180)+IF(Z37=\"w\",180,Z37/Y35*180)","v":243},{"$f":"AF35*10000000+AJ35*AF10034*10000000+AJ35*1000-AK35","v":20359757},{"$f":"IF(AD35=\"\",\"\",RANK(AL35:AL37,AL35:AL37,0))","v":1},null,{"$f":"$A$5","v":"NRC"},null,{"$f":"【進行】結果入力表!D69","v":"吉向"},null,{"$f":"【準備】登録!L11","v":180},null,null,{"$f":"IF(【進行】結果入力表!F69=\"\",\"\",【進行】結果入力表!F69)","v":"w"},null,{"$f":"IF(【進行】結果入力表!F61=\"\",\"\",【進行】結果入力表!F61)","v":"w"},null,{"$f":"IF(AX35=\"\",\"\",COUNTIF(AT35:AY35,\"w\"))","v":2},{"$f":"IF(AX35=\"\",\"\",COUNT(AV35,AX35))","v":0},{"$f":"SUM(AT35:AY35)+AZ35*AS35","v":360},null,{"$f":"IF(AX35=\"\",\"\",BB35/AS35*180)","v":360},{"$f":"IF(AT36=\"w\",180,AT36/AS35*180)+IF(AT37=\"w\",180,AT37/AS35*180)","v":217},{"$f":"AZ35*10000000+BD35*AZ10034*10000000+BD35*1000-BE35","v":20359783},{"$f":"IF(AX35=\"\",\"\",RANK(BF35:BF37,BF35:BF37,0))","v":1}]
[{"$f":"$A$6","v":"WRC"},null,{"$f":"【進行】結果入力表!I21","v":"松房"},null,{"$f":"【準備】登録!X12","v":140},{"$f":"IF(【進行】結果入力表!G21=\"\",\"\",【進行】結果入力表!G21)","v":99},null,null,null,{"$f":"IF(【進行】結果入力表!F29=\"\",\"\",【進行】結果入力表!F29)","v":"w"},null,{"$f":"IF(J35=\"\",\"\",COUNTIF(F36:K36,\"w\"))","v":1},{"$f":"IF(J35=\"\",\"\",COUNT(F36,J36))","v":1},{"$f":"SUM(F36:K36)+L36*E36","v":239},null,{"$f":"IF(J35=\"\",\"\",N36/E36*180)","v":307.28571428571428},{"$f":"IF(H35=\"w\",180,H35/E36*180)+IF(H37=\"w\",180,H37/E36*180)","v":243},{"$f":"L36*10000000+P36*L10035*10000000+P36*1000-Q36","v":10307042.714285715},{"$f":"IF(J35=\"\",\"\",RANK(R35:R37,R35:R37,0))","v":2},null,{"$f":"$A$6","v":"WRC"},null,{"$f":"【進行】結果入力表!I45","v":"中本"},null,{"$f":"【準備】登録!U12","v":180},{"$f":"IF(【進行】結果入力表!G45=\"\",\"\",【進行】結果入力表!G45)","v":141},null,null,null,{"$f":"IF(【進行】結果入力表!F53=\"\",\"\",【進行】結果入力表!F53)","v":156},null,{"$f":"IF(AD35=\"\",\"\",COUNTIF(Z36:AE36,\"w\"))","v":0},{"$f":"IF(AD35=\"\",\"\",COUNT(Z36,AD36))","v":2},{"$f":"SUM(Z36:AE36)+AF36*Y36","v":297},null,{"$f":"IF(AD35=\"\",\"\",AH36/Y36*180)","v":297},{"$f":"IF(AB35=\"w\",180,AB35/Y36*180)+IF(AB37=\"w\",180,AB37/Y36*180)","v":360},{"$f":"AF36*10000000+AJ36*AF10035*10000000+AJ36*1000-AK36","v":296640},{"$f":"IF(AD35=\"\",\"\",RANK(AL35:AL37,AL35:AL37,0))","v":3},null,{"$f":"$A$6","v":"WRC"},null,{"$f":"【進行】結果入力表!I69","v":"大迫"},null,{"$f":"【準備】登録!R12","v":180},{"$f":"IF(【進行】結果入力表!G69=\"\",\"\",【進行】結果入力表!G69)","v":165},null,null,null,{"$f":"IF(【進行】結果入力表!F77=\"\",\"\",【進行】結果入力表!F77)","v":52},null,{"$f":"IF(AX35=\"\",\"\",COUNTIF(AT36:AY36,\"w\"))","v":0},{"$f":"IF(AX35=\"\",\"\",COUNT(AT36,AX36))","v":2},{"$f":"SUM(AT36:AY36)+AZ36*AS36","v":217},null,{"$f":"IF(AX35=\"\",\"\",BB36/AS36*180)","v":217},{"$f":"IF(AV35=\"w\",180,AV35/AS36*180)+IF(AV37=\"w\",180,AV37/AS36*180)","v":360},{"$f":"AZ36*10000000+BD36*AZ10035*10000000+BD36*1000-BE36","v":216640},{"$f":"IF(AX35=\"\",\"\",RANK(BF35:BF37,BF35:BF37,0))","v":3}]
[{"$f":"$A$7","v":"SBC"},null,{"$f":"【進行】結果入力表!I13","v":"大橋"},null,{"$f":"【準備】登録!X13","v":140},{"$f":"IF(【進行】結果入力表!G13=\"\",\"\",【進行】結果入力表!G13)","v":53},null,{"$f":"IF(【進行】結果入力表!G29=\"\",\"\",【進行】結果入力表!G29)","v":49},null,null,null,{"$f":"IF(J35=\"\",\"\",COUNTIF(F37:K37,\"w\"))","v":0},{"$f":"IF(J35=\"\",\"\",COUNT(F37,H37))","v":2},{"$f":"SUM(F37:K37)+L37*E37","v":102},null,{"$f":"IF(J35=\"\",\"\",N37/E37*180)","v":131.14285714285714},{"$f":"IF(J35=\"w\",180,J35/E37*180)+IF(J36=\"w\",180,J36/E37*180)","v":360},{"$f":"L37*10000000+P37*L10036*10000000+P37*1000-Q37","v":130782.85714285713},{"$f":"IF(J35=\"\",\"\",RANK(R35:R37,R35:R37,0))","v":3},null,{"$f":"$A$7","v":"SBC"},null,{"$f":"【進行】結果入力表!I37","v":"大橋"},null,{"$f":"【準備】登録!X13","v":140},{"$f":"IF(【進行】結果入力表!G37=\"\",\"\",【進行】結果入力表!G37)","v":102},null,{"$f":"IF(【進行】結果入力表!G53=\"\",\"\",【進行】結果入力表!G53)","v":"w"},null,null,null,{"$f":"IF(AD35=\"\",\"\",COUNTIF(Z37:AE37,\"w\"))","v":1},{"$f":"IF(AD35=\"\",\"\",COUNT(Z37,AB37))","v":1},{"$f":"SUM(Z37:AE37)+AF37*Y37","v":242},null,{"$f":"IF(AD35=\"\",\"\",AH37/Y37*180)","v":311.14285714285717},{"$f":"IF(AD35=\"w\",180,AD35/Y37*180)+IF(AD36=\"w\",180,AD36/Y37*180)","v":380.57142857142856},{"$f":"AF37*10000000+AJ37*AF10036*10000000+AJ37*1000-AK37","v":10310762.285714285},{"$f":"IF(AD35=\"\",\"\",RANK(AL35:AL37,AL35:AL37,0))","v":2},null,{"$f":"$A$7","v":"SBC"},null,{"$f":"【進行】結果入力表!I61","v":"大橋"},null,{"$f":"【準備】登録!X13","v":140},{"$f":"IF(【進行】結果入力表!G61=\"\",\"\",【進行】結果入力表!G61)","v":52},null,{"$f":"IF(【進行】結果入力表!G77=\"\",\"\",【進行】結果入力表!G77)","v":"w"},null,null,null,{"$f":"IF(AX35=\"\",\"\",COUNTIF(AT37:AY37,\"w\"))","v":1},{"$f":"IF(AX35=\"\",\"\",COUNT(AT37,AV37))","v":1},{"$f":"SUM(AT37:AY37)+AZ37*AS37","v":192},null,{"$f":"IF(AX35=\"\",\"\",BB37/AS37*180)","v":246.85714285714286},{"$f":"IF(AX35=\"w\",180,AX35/AS37*180)+IF(AX36=\"w\",180,AX36/AS37*180)","v":246.85714285714286},{"$f":"AZ37*10000000+BD37*AZ10036*10000000+BD37*1000-BE37","v":10246610.285714287},{"$f":"IF(AX35=\"\",\"\",RANK(BF35:BF37,BF35:BF37,0))","v":2}]
[]
[{"$f":"IF(【準備】登録!Y11=\"\",\"\",【準備】登録!Y9)","v":""},null,"Name",null,{"$f":"E$4","v":"持点"},{"$f":"$A$40","v":""},null,{"$f":"$A$41","v":""},null,{"$f":"$A$42","v":""},null,"W","L","TP",null,"TP","LP","R_P","R",null,{"$f":"A39","v":""},null,"Name",null,{"$f":"$E$4","v":"持点"},{"$f":"$A$40","v":""},null,{"$f":"$A$41","v":""},null,{"$f":"$A$42","v":""},null,"W","L","TP",null,"TP","LP","R_P","R",null,{"$f":"A39","v":""},null,"Name",null,{"$f":"$E$4","v":"持点"},{"$f":"$A$40","v":""},null,{"$f":"$A$41","v":""},null,{"$f":"$A$42","v":""},null,"W","L","TP",null,"TP","LP","R_P","R"]
[{"$f":"IF(【準備】登録!Y11=\"\",\"\",$A$5)","v":""},null,{"$f":"【進行】結果入力表!D14","v":""},null,{"$f":"【準備】登録!AA11","v":180},null,null,{"$f":"IF(【進行】結果入力表!F22=\"\",\"\",【進行】結果入力表!F22)","v":""},null,{"$f":"IF(【進行】結果入力表!F14=\"\",\"\",【進行】結果入力表!F14)","v":""},null,{"$f":"IF(J40=\"\",\"\",COUNTIF(F40:K40,\"w\"))","v":""},{"$f":"IF(J40=\"\",\"\",COUNT(H40,J40))","v":""},{"$f":"SUM(F40:K40)+L40*E40","v":{"$error":"#VALUE!"}},null,{"$f":"IF(J40=\"\",\"\",N40/E40*180)","v":""},{"$f":"IF(F41=\"w\",180,F41/E40*180)+IF(F42=\"w\",180,F42/E40*180)","v":{"$error":"#VALUE!"}},{"$f":"L40*10000000+P40*L10039*10000000+P40*1000-Q40","v":{"$error":"#VALUE!"}},{"$f":"IF(J40=\"\",\"\",RANK(R40:R42,R40:R42,0))","v":""},null,{"$f":"$A40","v":""},null,{"$f":"【進行】結果入力表!D46","v":""},null,{"$f":"【準備】登録!U11","v":180},null,null,{"$f":"IF(【進行】結果入力表!F46=\"\",\"\",【進行】結果入力表!F46)","v":""},null,{"$f":"IF(【進行】結果入力表!F38=\"\",\"\",【進行】結果入力表!F38)","v":""},null,{"$f":"IF(AD40=\"\",\"\",COUNTIF(Z40:AE40,\"w\"))","v":""},{"$f":"IF(AD40=\"\",\"\",COUNT(AB40,AD40))","v":""},{"$f":"SUM(Z40:AE40)+AF40*Y40","v":{"$error":"#VALUE!"}},null,{"$f":"IF(AD40=\"\",\"\",AH40/Y40*180)","v":""},{"$f":"IF(Z41=\"w\",180,Z41/Y40*180)+IF(Z42=\"w\",180,Z42/Y40*180)","v":{"$error":"#VALUE!"}},{"$f":"AF40*10000000+AJ40*AF10039*10000000+AJ40*1000-AK40","v":{"$error":"#VALUE!"}},{"$f":"IF(AD40=\"\",\"\",RANK(AL40:AL42,AL40:AL42,0))","v":""},null,{"$f":"$A40","v":""},null,{"$f":"【進行】結果入力表!D70","v":""},null,{"$f":"【準備】登録!O11","v":180},null,null,{"$f":"IF(【進行】結果入力表!F70=\"\",\"\",【進行】結果入力表!F70)","v":""},null,{"$f":"IF(【進行】結果入力表!F62=\"\",\"\",【進行】結果入力表!F62)","v":""},null,{"$f":"IF(AX40=\"\",\"\",COUNTIF(AT40:AY40,\"w\"))","v":""},{"$f":"IF(AX40=\"\",\"\",COUNT(AV40,AX40))","v":""},{"$f":"SUM(AT40:AY40)+AZ40*AS40","v":{"$error":"#VALUE!"}},null,{"$f":"IF(AX40=\"\",\"\",BB40/AS40*180)","v":""},{"$f":"IF(AT41=\"w\",180,AT41/AS40*180)+IF(AT42=\"w\",180,AT42/AS40*180)","v":{"$error":"#VALUE!"}},{"$f":"AZ40*10000000+BD40*AZ10039*10000000+BD40*1000-BE40","v":{"$error":"#VALUE!"}},{"$f":"IF(AX40=\"\",\"\",RANK(BF40:BF42,BF40:BF42,0))","v":""}]
[{"$f":"IF(【準備】登録!Y12=\"\",\"\",$A$6)","v":""},null,{"$f":"【進行】結果入力表!I22","v":""},null,{"$f":"【準備】登録!AA12","v":140},{"$f":"IF(【進行】結果入力表!G22=\"\",\"\",【進行】結果入力表!G22)","v":""},null,null,null,{"$f":"IF(【進行】結果入力表!F30=\"\",\"\",【進行】結果入力表!F30)","v":""},null,{"$f":"IF(J40=\"\",\"\",COUNTIF(F41:K41,\"w\"))","v":""},{"$f":"IF(J40=\"\",\"\",COUNT(F41,J41))","v":""},{"$f":"SUM(F41:K41)+L41*E41","v":{"$error":"#VALUE!"}},null,{"$f":"IF(J40=\"\",\"\",N41/E41*180)","v":""},{"$f":"IF(H40=\"w\",180,H40/E41*180)+IF(H42=\"w\",180,H42/E41*180)","v":{"$error":"#VALUE!"}},{"$f":"L41*10000000+P41*L10040*10000000+P41*1000-Q41","v":{"$error":"#VALUE!"}},{"$f":"IF(J40=\"\",\"\",RANK(R40:R42,R40:R42,0))","v":""},null,{"$f":"$A41","v":""},null,{"$f":"【進行】結果入力表!I46","v":""},null,{"$f":"【準備】登録!X12","v":140},{"$f":"IF(【進行】結果入力表!G46=\"\",\"\",【進行】結果入力表!G46)","v":""},null,null,null,{"$f":"IF(【進行】結果入力表!F54=\"\",\"\",【進行】結果入力表!F54)","v":""},null,{"$f":"IF(AD40=\"\",\"\",COUNTIF(Z41:AE41,\"w\"))","v":""},{"$f":"IF(AD40=\"\",\"\",COUNT(Z41,AD41))","v":""},{"$f":"SUM(Z41:AE41)+AF41*Y41","v":{"$error":"#VALUE!"}},null,{"$f":"IF(AD40=\"\",\"\",AH41/Y41*180)","v":""},{"$f":"IF(AB40=\"w\",180,AB40/Y41*180)+IF(AB42=\"w\",180,AB42/Y41*180)","v":{"$error":"#VALUE!"}},{"$f":"AF41*10000000+AJ41*AF10040*10000000+AJ41*1000-AK41","v":{"$error":"#VALUE!"}},{"$f":"IF(AD40=\"\",\"\",RANK(AL40:AL42,AL40:AL42,0))","v":""},null,{"$f":"$A41","v":""},null,{"$f":"【進行】結果入力表!I70","v":""},null,{"$f":"【準備】登録!U12","v":180},{"$f":"IF(【進行】結果入力表!G70=\"\",\"\",【進行】結果入力表!G70)","v":""},null,null,null,{"$f":"IF(【進行】結果入力表!F78=\"\",\"\",【進行】結果入力表!F78)","v":""},null,{"$f":"IF(AX40=\"\",\"\",COUNTIF(AT41:AY41,\"w\"))","v":""},{"$f":"IF(AX40=\"\",\"\",COUNT(AT41,AX41))","v":""},{"$f":"SUM(AT41:AY41)+AZ41*AS41","v":{"$error":"#VALUE!"}},null,{"$f":"IF(AX40=\"\",\"\",BB41/AS41*180)","v":""},{"$f":"IF(AV40=\"w\",180,AV40/AS41*180)+IF(AV42=\"w\",180,AV42/AS41*180)","v":{"$error":"#VALUE!"}},{"$f":"AZ41*10000000+BD41*AZ10040*10000000+BD41*1000-BE41","v":{"$error":"#VALUE!"}},{"$f":"IF(AX40=\"\",\"\",RANK(BF40:BF42,BF40:BF42,0))","v":""}]
[{"$f":"IF(【準備】登録!Y13=\"\",\"\",$A$7)","v":""},null,{"$f":"【進行】結果入力表!I14","v":""},null,{"$f":"【準備】登録!AA13","v":140},{"$f":"IF(【進行】結果入力表!G14=\"\",\"\",【進行】結果入力表!G14)","v":""},null,{"$f":"IF(C40=\"\",\"\",【進行】結果入力表!G30)","v":""},null,null,null,{"$f":"IF(J40=\"\",\"\",COUNTIF(F42:K42,\"w\"))","v":""},{"$f":"IF(J40=\"\",\"\",COUNT(F42,H42))","v":""},{"$f":"SUM(F42:K42)+L42*E42","v":{"$error":"#VALUE!"}},null,{"$f":"IF(J40=\"\",\"\",N42/E42*180)","v":""},{"$f":"IF(J40=\"w\",180,J40/E42*180)+IF(J41=\"w\",180,J41/E42*180)","v":{"$error":"#VALUE!"}},{"$f":"L42*10000000+P42*L10041*10000000+P42*1000-Q42","v":{"$error":"#VALUE!"}},{"$f":"IF(J40=\"\",\"\",RANK(R40:R42,R40:R42,0))","v":""},null,{"$f":"$A42","v":""},null,{"$f":"【進行】結果入力表!I38","v":""},null,{"$f":"【準備】登録!AA13","v":140},{"$f":"IF(【進行】結果入力表!G38=\"\",\"\",【進行】結果入力表!G38)","v":""},null,{"$f":"IF(【進行】結果入力表!G54=\"\",\"\",【進行】結果入力表!G54)","v":""},null,null,null,{"$f":"IF(AD40=\"\",\"\",COUNTIF(Z42:AE42,\"w\"))","v":""},{"$f":"IF(AD40=\"\",\"\",COUNT(Z42,AB42))","v":""},{"$f":"SUM(Z42:AE42)+AF42*Y42","v":{"$error":"#VALUE!"}},null,{"$f":"IF(AD40=\"\",\"\",AH42/Y42*180)","v":""},{"$f":"IF(AD40=\"w\",180,AD40/Y42*180)+IF(AD41=\"w\",180,AD41/Y42*180)","v":{"$error":"#VALUE!"}},{"$f":"AF42*10000000+AJ42*AF10041*10000000+AJ42*1000-AK42","v":{"$error":"#VALUE!"}},{"$f":"IF(AD40=\"\",\"\",RANK(AL40:AL42,AL40:AL42,0))","v":""},null,{"$f":"$A42","v":""},null,{"$f":"【進行】結果入力表!I62","v":""},null,{"$f":"【準備】登録!AA13","v":140},{"$f":"IF(【進行】結果入力表!G62=\"\",\"\",【進行】結果入力表!G62)","v":""},null,{"$f":"IF(【進行】結果入力表!G78=\"\",\"\",【進行】結果入力表!G78)","v":""},null,null,null,{"$f":"IF(AX40=\"\",\"\",COUNTIF(AT42:AY42,\"w\"))","v":""},{"$f":"IF(AX40=\"\",\"\",COUNT(AT42,AV42))","v":""},{"$f":"SUM(AT42:AY42)+AZ42*AS42","v":{"$error":"#VALUE!"}},null,{"$f":"IF(AX40=\"\",\"\",BB42/AS42*180)","v":""},{"$f":"IF(AX40=\"w\",180,AX40/AS42*180)+IF(AX41=\"w\",180,AX41/AS42*180)","v":{"$error":"#VALUE!"}},{"$f":"AZ42*10000000+BD42*AZ10041*10000000+BD42*1000-BE42","v":{"$error":"#VALUE!"}},{"$f":"IF(AX40=\"\",\"\",RANK(BF40:BF42,BF40:BF42,0))","v":""}]
[null,"※","TPの数字は、ハンデによる換算後の得点を示す。"]

{"sheet":"【結果】総合結果表","index":5,"n_rows":34,"n_cols":37,"rows_kept":34,"cut":false,"hidden":false,"merged":[[0,1,1,39],[3,36,3,39],[5,1,6,4],[7,1,8,4],[5,24,6,27],[7,24,8,27],[7,5,8,12],[7,13,8,22],[7,23,8,23],[5,23,6,23],[7,28,8,31],[7,32,8,39],[5,5,6,12],[5,13,6,22],[5,28,6,31],[5,32,6,39],[21,36,26,39],[27,26,32,29],[27,36,32,39],[21,30,22,33],[23,30,26,33],[27,30,28,33],[29,30,32,33],[21,26,26,29],[11,30,14,33],[11,36,14,39],[15,26,20,29],[15,36,20,39],[17,30,20,33],[15,30,16,33],[11,26,14,29],[15,22,20,25],[13,4,14,6],[13,7,14,9],[13,10,14,12],[13,13,14,15],[13,16,14,18],[13,19,14,21],[17,13,18,15],[17,16,18,18],[17,19,18,21],[19,10,20,12],[19,13,20,15],[17,10,18,12],[11,4,12,9],[11,10,12,15],[11,16,12,21],[15,16,16,18],[27,22,32,25],[11,22,14,25],[21,22,26,25],[15,19,16,21],[19,16,20,18],[19,19,20,21],[15,10,16,12],[15,13,16,15],[31,10,32,12],[31,13,32,15],[29,10,30,12],[29,13,30,15],[27,13,28,15],[25,19,26,21],[21,10,26,15],[23,19,24,21],[21,16,22,18],[21,19,22,21],[25,16,26,18],[23,16,24,18],[27,10,28,12],[27,16,32,21],[15,1,20,3],[21,1,26,3],[27,1,32,3],[21,4,22,6],[27,4,28,6],[15,4,20,9],[21,7,22,9],[23,4,24,6],[31,4,32,6],[29,4,30,6],[25,4,26,6],[29,7,30,9],[31,7,32,9],[23,7,24,9],[25,7,26,9],[27,7,28,9]]}
[null,{"$f":"【結果】個人成績表!A1","v":"第16回　和奈滋対抗戦　　　(奈良；キングスポット)"}]
[]
[]
[null,null,null,null,null,null,null,null,null,null,null,null,null,null,null,null,null,null,null,null,null,null,null,null,null,null,null,null,null,null,null,null,null,null,null,null,{"$f":"【準備】登録!D4","v":"2018-11-18"}]
[]
[null,"MVP",null,null,null,"吉向　翔平",null,null,null,null,null,null,null,"NRC　６勝０敗",null,null,null,null,null,null,null,null,null,null,"VP",null,null,null,"杉本　博章",null,null,null,"WRC　５勝１敗"]
[]
[null,"HR",null,null,null,"末岡　修",null,null,null,null,null,null,null,"WRC　135点",null,null,null,null,null,null,null,null,null,null,"VP",null,null,null,"林　秀忠",null,null,null,"SBC　３勝３敗"]
[]
[]
[]
[null,null,null,null,{"$f":"B16","v":"NRC"},null,null,null,null,null,{"$f":"B22","v":"WRC"},null,null,null,null,null,{"$f":"B28","v":"SBC"},null,null,null,null,null,"W",null,null,null,"L",null,null,null,"TP",null,null,null,null,null,"RK"]
[null,null,null,null,null,null,null,null,null,null,null,null,null,null,null,null,null,null,null,null,null,null,null,null,null,null,null,null,null,null,null,null,null,null,"(TP)","TP"]
[null,null,null,null,"W",null,null,"L",null,null,"W",null,null,"L",null,null,"W",null,null,"L"]
[]
[null,{"$f":"IF(【準備】登録!B11=\"\",\"\",【準備】登録!B11)","v":"NRC"},null,null,null,null,null,null,null,null,{"$f":"IF(【結果】個人成績表!R14=\"\",\"\",【結果】個人成績表!R14-Q16)","v":5},null,null,{"$f":"IF(【結果】個人成績表!S14=\"\",\"\",【結果】個人成績表!S14-T16)","v":2},null,null,{"$f":"【結果】個人成績表!H14","v":6},null,null,{"$f":"【結果】個人成績表!I14","v":1},null,null,{"$f":"IF(Q16=\"\",\"\",SUM(Q16:S21,K16:M21))","v":27},null,null,null,{"$f":"IF(T16=\"\",\"\",SUM(T16:V21,N16:P21))","v":15},null,null,null,{"$f":"IF(【結果】個人成績表!BH14=\"\",\"\",\"(\"&【結果】個人成績表!BH14&\")\")","v":"(6229)"},null,null,null,{"$f":"【結果】個人成績表!BH14","v":6229},{"$f":"【結果】個人成績表!CE14","v":6450.1428571428569},{"$f":"IF(AE18=\"\",\"\",RANK(W$16:W$33,W$16:W$33,0))","v":1}]
[]
[null,null,null,null,null,null,null,null,null,null,{"$f":"IF(【結果】個人成績表!AL14=\"\",\"\",【結果】個人成績表!AL14-【結果】個人成績表!AB14)","v":5},null,null,{"$f":"IF(【結果】個人成績表!AM14=\"\",\"\",【結果】個人成績表!AM14-【結果】個人成績表!AC14)","v":2},null,null,{"$f":"IF(【結果】個人成績表!AB14=\"\",\"\",【結果】個人成績表!AB14-【結果】個人成績表!R14)","v":4},null,null,{"$f":"IF(【結果】個人成績表!AC14=\"\",\"\",【結果】個人成績表!AC14-【結果】個人成績表!S14)","v":3},null,null,null,null,null,null,null,null,null,null,{"$f":"IF(【結果】個人成績表!CE14=0,\"\",【結果】個人成績表!CE14)","v":6450.1428571428569}]
[]
[null,null,null,null,null,null,null,null,null,null,{"$f":"IF(【結果】個人成績表!BF14=\"\",\"\",【結果】個人成績表!BF14-【結果】個人成績表!AV14)","v":2},null,null,{"$f":"IF(【結果】個人成績表!BG14=\"\",\"\",【結果】個人成績表!BG14-【結果】個人成績表!AW14)","v":5},null,null,{"$f":"IF(【結果】個人成績表!AV14=\"\",\"\",【結果】個人成績表!AV14-【結果】個人成績表!AL14)","v":5},null,null,{"$f":"IF(【結果】個人成績表!AW14=\"\",\"\",【結果】個人成績表!AW14-【結果】個人成績表!AM14)","v":2}]
[]
[null,{"$f":"IF(【準備】登録!B12=\"\",\"\",【準備】登録!B12)","v":"WRC"},null,null,{"$f":"N16","v":2},null,null,{"$f":"K16","v":5},null,null,null,null,null,null,null,null,{"$f":"IF(【結果】個人成績表!R24=\"\",\"\",【結果】個人成績表!R24-【結果】個人成績表!H24)","v":5},null,null,{"$f":"IF(【結果】個人成績表!S24=\"\",\"\",【結果】個人成績表!S24-【結果】個人成績表!I24)","v":2},null,null,{"$f":"IF(E22=\"\",\"\",SUM(E22:G27,Q22:S27))","v":21},null,null,null,{"$f":"IF(H22=\"\",\"\",SUM(H22:J27,T22:V27))","v":21},null,null,null,{"$f":"IF(【結果】個人成績表!BH24=\"\",\"\",\"(\"&【結果】個人成績表!BH24&\")\")","v":"(5916)"},null,null,null,{"$f":"【結果】個人成績表!BH24","v":5916},{"$f":"【結果】個人成績表!CE24","v":6144.2857142857138},{"$f":"IF(AE24=\"\",\"\",RANK(W$16:W$33,W$16:W$33,0))","v":2}]
[]
[null,null,null,null,{"$f":"N18","v":2},null,null,{"$f":"K18","v":5},null,null,null,null,null,null,null,null,{"$f":"IF(【結果】個人成績表!AL24=\"\",\"\",【結果】個人成績表!AL24-【結果】個人成績表!AB24)","v":4},null,null,{"$f":"IF(【結果】個人成績表!AM24=\"\",\"\",【結果】個人成績表!AM24-【結果】個人成績表!AC24)","v":3},null,null,null,null,null,null,null,null,null,null,{"$f":"IF(【結果】個人成績表!CE24=0,\"\",【結果】個人成績表!CE24)","v":6144.2857142857138}]
[]
[null,null,null,null,{"$f":"N20","v":5},null,null,{"$f":"K20","v":2},null,null,null,null,null,null,null,null,{"$f":"IF(【結果】個人成績表!BF24=\"\",\"\",【結果】個人成績表!BF24-【結果】個人成績表!AV24)","v":3},null,null,{"$f":"IF(【結果】個人成績表!BG24=\"\",\"\",【結果】個人成績表!BG24-【結果】個人成績表!AW24)","v":4}]
[]
[null,{"$f":"IF(【準備】登録!B13=\"\",\"\",【準備】登録!B13)","v":"SBC"},null,null,{"$f":"【結果】個人成績表!H34","v":1},null,null,{"$f":"【結果】個人成績表!I34","v":6},null,null,{"$f":"T22","v":2},null,null,{"$f":"Q22","v":5},null,null,null,null,null,null,null,null,{"$f":"IF(E28=\"\",\"\",SUM(E28:G33,K28:M33))","v":15},null,null,null,{"$f":"IF(H28=\"\",\"\",SUM(H28:J33,N28:P33))","v":27},null,null,null,{"$f":"IF(【結果】個人成績表!BH34=\"\",\"\",\"(\"&【結果】個人成績表!BH34&\")\")","v":"(5313)"},null,null,null,{"$f":"【結果】個人成績表!BH34","v":5313},{"$f":"【結果】個人成績表!CE34","v":5466.1428571428569},{"$f":"IF(AE30=\"\",\"\",RANK(W$16:W$33,W$16:W$33,0))","v":3}]
[]
[null,null,null,null,{"$f":"T18","v":3},null,null,{"$f":"Q18","v":4},null,null,{"$f":"T24","v":3},null,null,{"$f":"Q24","v":4},null,null,null,null,null,null,null,null,null,null,null,null,null,null,null,null,{"$f":"IF(【結果】個人成績表!CE34=0,\"\",【結果】個人成績表!CE34)","v":5466.1428571428569}]
[]
[null,null,null,null,{"$f":"T20","v":2},null,null,{"$f":"Q20","v":5},null,null,{"$f":"T26","v":4},null,null,{"$f":"Q26","v":3}]
[]
[null,null,null,"※","TPの上段（　　）内の数字は、ハンデによる換算をしていない得点を示す。"]